The Linux Foundation

 
TestPilot32-C51

From The Linux Foundation

Contents

Summary

   Command Tests
    Command Check 	  v 3.1.95-1 	Success 	Passed: 140
   Static Interface Tests
    Library Check 	  v 3.1.95-1 	Warnings: 27 	Passed: 48440
   Runtime Interface Tests
    Core Tests 		  v 3.1.95-4 	Failures: 10 	Passed: 5364
    Desktop-T2C Tests 	  v 3.1.95-3 	Failures: 2 	Passed: 2803
    Desktop Tests:	  v 3.1.95-5	
        Fontconfig Tests 	Success 	Passed: 3
        FreeType Tests 		Success 	Passed: 4
        GTK Tests 		Failures: 1 	Passed: 8153
        Libpng Tests 		Success 	Passed: 137
        Libxml Tests 		Success 	Passed: 2314
        Qt3 Tests 		Success 	Passed: 26
        Qt4 Tests 		Failures: 12 	Passed: 1302
        XRender Tests 		Success 	Passed: 1
        Xft Tests 		Success 	Passed: 4
    Libstdc++ Tests 	  v 3.4.3-6.95 	Success 	Passed: 1274
    Perl Tests 		  v 3.1.95-3 	Failures: 4 	Passed: 924
    Printing Tests 	  v 3.1.96-1 	Failures: 2 	Passed: 82
    Python Runtime Tests  v 3.1.95-3 	Failures: 1 	Passed: 107
    X11 Tests (XTS5) 	  v 5.1.5-4 	Failures: 53 	Passed: 3348
   Automated Application Battery Tests
    Apache Tests 	  v 2.2.4-2 	Failures: 1 	Passed: 5
    Expect Tests 	  v 5.43.0-5 	Success 	Passed: 6
    Groff Tests 	  v 1.19.2-2 	Success 	Passed: 5
    Lynx Tests 		  v 2.8.6-1 	Success 	Passed: 20
    Python Tests 	  v 2.4.4-1 	Success 	Passed: 291
    Raptor Tests 	  v 1.4.15-1 	Success 	Passed: 56
    Rsync Tests 	  v 2.6.9-1 	Success 	Passed: 6
    Samba Tests 	  v 3.0.25b-1 	Success 	Passed: 6
    Tcl Tests 		  v 8.5a4-1 	Success 	Passed: 134
    Xpdf Tests 		  v 1.01-5 	Success 	Passed: 3

Details of tests that failed

Core Tests v 3.1.95-4

/tset/ANSI.os/maths/pow/T.pow 4 	Warning (quelled) 	Insignificant
Messages from the test

pow(0.0, -1.0) gave
RETURN VALUES: expected: -inf, observed: inf
Bit Representation: expected value: \000\000\000\000\000\000\360\377
Bit Representation: observed value: \000\000\000\000\000\000\360\177
Comment:
Both -inf and +inf are equally artificial results, Linux libc picks this one.
/tset/ANSI.os/streamio/fopen/T.fopen 28 	Warning (quelled) 	Insignificant
Messages from the test

fopen() succeeded when FOPEN_MAX streams were already open
Comment:
FOPEN_MAX is just an advisory limit, there is probably no real limit except memory.
/tset/ANSI.os/streamio/remove_X/T.remove_X 1 	Warning (quelled) 	Feature
Messages from the test

remove("remove_X-t.1") did not give correct results
RETURN VALUES: expected: -1, observed: 0
ERRNO VALUES: expected: 26 (ETXTBSY), observed: 0 (NO ERROR)
Comment:
Linux allows to remove a running executable file without any side effects.
/tset/ANSI.os/streamio/tmpfile/T.tmpfile 2 	Warning (quelled) 	Feature
Messages from the test

Note: There is a known issue with this test, see POSIX interpretation 1003.1-1990 #74
Note: This test is waived for LSB testing, please see the waivers database
tmpfile() did not creat file with mode 0666 when umask was set to 0, found 0600
Comment:
Not a bug but feature. Linux tmpfile() creates files with access rights 0600 which is more secure than POSIX mandated 0666.
/tset/POSIX.os/dataform/tar/T.tar 12 	FIP (quelled) 	Correct
Messages from the test

create utility exited with code 1
Comment:
This test tries to call tar with a file with too long name (>100 chars). The tar utility can either skip the file, or fail completely; both results are correct.
/tset/POSIX.os/devclass/c_iflag/T.c_iflag 19 	Warning (quelled) 	Normal
Messages from the test

This test will not pass when using pseudo ttys
Comment:
This is a normal result unless a hardware terminal is used (which is very rare).
/tset/POSIX.os/devclass/c_lflag/T.c_lflag 6 	Warning (quelled) 	Normal
Messages from the test

This test will not pass when using pseudo ttys
Comment:
This is a normal result unless a hardware terminal is used (which is very rare).
/tset/POSIX.os/devclass/tcdrain/T.tcdrain 2 	Warning (quelled) 	Normal
Messages from the test

This test will not pass when using pseudo ttys
Comment:
This is a normal result unless a hardware terminal is used (which is very rare).
/tset/POSIX.os/devclass/tcsetattr/T.tcsetattr 8 	Warning (quelled) 	Normal
Messages from the test

This test will not pass when using pseudo ttys
Comment:
This is a normal result unless a hardware terminal is used (which is very rare).
/tset/POSIX.os/files/access_X/T.access_X 1 	Warning (quelled) 	Feature
Messages from the test

access("access_X-t.1", W_OK) did not give correct results
RETURN VALUES: expected: -1, observed: 0
ERRNO VALUES: expected: 26 (ETXTBSY), observed: 0 (NO ERROR)
Comment:
On Linux, running executable files are normally accessible.
/tset/POSIX.os/files/rename_X/T.rename_X 1 	Warning (quelled) 	Feature
Messages from the test

rename("rename_X-t.1a", "rename_X-t.1b") did not give correct results
RETURN VALUES: expected: -1, observed: 0
ERRNO VALUES: expected: 26 (ETXTBSY), observed: 0 (NO ERROR)
Comment:
Not a bug but feature. On Linux, running executable files are normally accessible.
/tset/POSIX.os/files/stat_X/T.stat_X 1 	FIP  [?] 	
Messages from the test

stat("/opt/lsb/test/core/tet/test_sets/nonexistb", buf) returned st_rdev value of 0xfc01
/tset/POSIX.os/files/stat_X/T.stat_X 2 	FIP (quelled) 	Correct
Messages from the test

stat("/dev/tty", buf) returned st_rdev value of 0x500
Comment:
This is a correct result, /dev/tty has major/minor number 0x0500.
/tset/POSIX.os/files/unlink_X/T.unlink_X 1 	Warning (quelled) 	Feature
Messages from the test

unlink("unlink_X-t.1") did not give correct results
RETURN VALUES: expected: -1, observed: 0
ERRNO VALUES: expected: 26 (ETXTBSY), observed: 0 (NO ERROR)
Comment:
On Linux, running executable files are normally accessible.
/tset/POSIX.os/files/posix_madvise/T.posix_madvise 4 	Failed 	
Messages from the test

posix_madvise returned 0 instead of EINVAL
/tset/POSIX.os/procenv/sysconf/T.sysconf 3 	Warning (quelled) 	Insignificant
Messages from the test

CLK_TCK not defined (obsolescent in POSIX but required)
Comment:
Insignificant; CLK_TCK is obsolete anyway.
/tset/POSIX.os/procenv/sysconf_X/T.sysconf_X 2 	Failed 	
Messages from the test

sysconf(_SC_XOPEN_VERSION) failed expected 500 - got 600
/tset/POSIX.os/procenv/sysconf_X/T.sysconf_X 17 	FIP  [?] 	
Messages from the test

sysconf(_SC_XOPEN_ENH_I18N) returned 1
- indicating the feature group is fully supported
sysconf(_SC_XOPEN_CRYPT) returned 1
- indicating the feature group is supported
sysconf(_SC_XOPEN_SHM) returned 1
- indicating the feature group is supported
sysconf(_SC_XOPEN_LEGACY) returned 1
- indicating the feature group is fully supported
/tset/POSIX.os/procenv/times/T.times 1 	Failed 	
Messages from the test

change in elapsed time measured in CLK_TCKs is outside required accuracy
change in elapsed time is 1697.000000
least acceptable value is 1900.000000
/tset/POSIX.os/procenv/uname/T.uname 1 	FIP  [?] 	
Messages from the test

system name - Linux
node name - centia32.wichmann.us
release - 2.6.18-53.1.4.el5
version - #1 SMP Fri Nov 30 00:45:16 EST 2007
machine - i686
/tset/POSIX.os/procprim/kill_X/T.kill_X 1 	Warning (quelled) 	Insignificant
Messages from the test

process calling kill() did not receive signal 10
Comment:
The Linux implementation of kill() sends the signal to everyone except its own process, which is also logical.
/tset/initd/misc/install/general-tc 3 	Failed 	
Messages from the test

Reference 20.3-3(C) Testing activation of initscript
If an initscript depends on a boot facility it shall not be
activated by a call to install_initd if the dependency is not met
Call /usr/lib/lsb/install_initd /etc/init.d/lsb-initA
exit code 0 returned, expected 1
Check that lsb-initA is not installed in initscript directories
/etc/rc.d/rc0.d/K50lsb-initA: found a symlink
exit code 2 returned, expected 1
/etc/rc.d/rc1.d/K50lsb-initA: found a symlink
exit code 2 returned, expected 1
/etc/rc.d/rc2.d/S51lsb-initA: found a symlink
exit code 2 returned, expected 1
/etc/rc.d/rc3.d/S51lsb-initA: found a symlink
exit code 2 returned, expected 1
/etc/rc.d/rc4.d/S51lsb-initA: found a symlink
exit code 2 returned, expected 1
/etc/rc.d/rc5.d/S51lsb-initA: found a symlink
exit code 2 returned, expected 1
/etc/rc.d/rc6.d/K50lsb-initA: found a symlink
exit code 2 returned, expected 1
Cleanup, deactivate initscripts, if any
Cleanup, remove initscript files, if any
/tset/initd/misc/install/general-tc 5 	Failed 	
Messages from the test

Reference 20.4-5(C) Testing deactivation of initscript
If a boot facility provided by an initscript is depended on by another
initscript the script shall not be deactivated by a call to remove_initd
Call /usr/lib/lsb/install_initd /etc/init.d/lsb-initB
Call /usr/lib/lsb/install_initd /etc/init.d/lsb-initA
Check that lsb-initA is installed in initscript directories
/etc/rc.d/rc0.d/K50lsb-initA: found a symlink
/etc/rc.d/rc1.d/K50lsb-initA: found a symlink
/etc/rc.d/rc2.d/S51lsb-initA: found a symlink
/etc/rc.d/rc3.d/S51lsb-initA: found a symlink
/etc/rc.d/rc4.d/S51lsb-initA: found a symlink
/etc/rc.d/rc5.d/S51lsb-initA: found a symlink
/etc/rc.d/rc6.d/K50lsb-initA: found a symlink
Check that lsb-initB is installed in initscript directories
/etc/rc.d/rc0.d/K50lsb-initB: found a symlink
/etc/rc.d/rc1.d/K50lsb-initB: found a symlink
/etc/rc.d/rc2.d/S50lsb-initB: found a symlink
/etc/rc.d/rc3.d/S50lsb-initB: found a symlink
/etc/rc.d/rc4.d/S50lsb-initB: found a symlink
/etc/rc.d/rc5.d/S50lsb-initB: found a symlink
/etc/rc.d/rc6.d/K50lsb-initB: found a symlink
Call /usr/lib/lsb/install_initd /etc/init.d/lsb-initB
exit code 0 returned, expected non-zero
Check that lsb-initB is installed in initscript directories
/etc/rc.d/rc0.d/K??lsb-initB: file not found
/etc/rc.d/rc1.d/K??lsb-initB: file not found
/etc/rc.d/rc2.d/S??lsb-initB: file not found
exit code 1 returned, expected 2
/etc/rc.d/rc3.d/S??lsb-initB: file not found
exit code 1 returned, expected 2
/etc/rc.d/rc4.d/S??lsb-initB: file not found
exit code 1 returned, expected 2
/etc/rc.d/rc5.d/S??lsb-initB: file not found
exit code 1 returned, expected 2
/etc/rc.d/rc6.d/K??lsb-initB: file not found
Cleanup, deactivate initscripts, if any
Cleanup, remove initscript files, if any
/tset/LI18NUX2K.L1/utils/localedef/T.localedef 3 	Warning (quelled) 	Waived
Messages from the test

* When the locale specification exceeded implementation limits or the coded character set or sets used were not supported by the implementation, and no locale was created, verify the exit value is 2.

created locale unexpectedly
This test should not create locale and exit code code sould be 2.
eixt code of localedef is 0
if exit code is more than 3, please check directory if user 'vsx0' has write permission of the locale directory

*) This test result is waived now.
Comment:
This test is waived by the LSB committee.
/tset/LSB.fhs/var/cache-fonts/cache-fonts-tc 1 	FIP  [?] 	
Messages from the test

Reference 5.5.3-1(C)
The /var/cache/fonts directory may exist and is searchable
/var/cache/fonts: directory not found
exit code 1 returned, expected 0
This test result needs to be manually resolved, returning FIP result
/tset/LSB.fhs/var/spool-lpd/spool-lpd-tc 2 	FIP (quelled) 	Normal
Messages from the test

Reference 5.14.3-2(C)
If the implementation has the lpd daemon running then
The lock file /var/spool/lpd/lpd.lock exists
/var/spool/lpd/lpd.lock: file not found
exit code 1 returned, expected 0
This test result needs to be manually resolved
Comment:
Normal when lpd is not installed.
/tset/LSB.fhs/var/spool-rwho/spool-rwho-tc 1 	FIP (quelled) 	Normal
Messages from the test

Reference 5.14.4-1(C)
If the subsystem is supported
The /var/spool/rwho directory exists and is searchable
/var/spool/rwho: directory not found
exit code 1 returned, expected 0
This test result needs to be manually resolved, returning FIP result
Comment:
Normal when rwho is not installed.
/tset/LSB.os/genuts/ftw_L/T.ftw_L 4 	Warning (quelled) 	Insignificant
Messages from the test

ftw did not call function with argument FTW_SL and
correct first and second arguments when traversing
file tree
Comment:
The linux ftw() function follows symlinks, it does not report them.
/tset/LSB.os/genuts/getopt/T.getopt 1 	Warning (quelled) 	Known minor bug
Messages from the test

getopt() failed when called with :-
optstring : [ab:cd:e]
arguments : [-a] [-d]
optind : [2]
getopt() failed on the following :-
optind : expected [4], actual [3]

getopt() failed when called with :-
optstring : [ab:cd:e]
arguments : [-ab]
optind : [1]
getopt() failed on the following :-
optind : expected [3], actual [2]

getopt() failed when called with :-
optstring : [:ab:cd:e]
arguments : [-a] [-d]
optind : [2]
getopt() failed on the following :-
optind : expected [4], actual [3]

getopt() failed when called with :-
optstring : [:ab:cd:e]
arguments : [-ab]
optind : [1]
getopt() failed on the following :-
optind : expected [3], actual [2]
Comment:
This is a known minor bug related to locale handling.
/tset/LSB.os/libm/fpeOver/T.fpeOver 1 	Unreported 	
Messages from the test

When feenableexcept(FE_OVERFLOW) is set, and triggered by an overflow, the exception shall be handled by the defined signal handler.
/tset/LSB.os/libm/fpeOver/T.fpeOver 2 	Unresolved 	
Messages from the test

unexpected signal 8 (SIGFPE) received
/tset/LSB.os/libm/fpeUnder/T.fpeUnder 1 	Unreported 	
Messages from the test

When feenableexcept(FE_UNDERFLOW) is set, and triggered by an underflow, the exception shall be handled by the defined signal handler.
/tset/LSB.os/libm/fpeUnder/T.fpeUnder 2 	Failed 	
Messages from the test

When fedisableexcept(FE_UNDERFLOW) is set, and triggered by an underflow, the exception should not be handled by the defined signal handler.
Signal handler fpeHandler2 called when not expected
/tset/LSB.pam/testcases/pam_acct_mgmt/pam_acct_mgmt 5 	Failed (quelled) 	TEF's fault
Messages from the test

pam_authenticate returned Authentication failure when expected to succeed
uid : 501
euid : 0
initialise failed
Comment:
This test fails because Test Execution Framework hacks PAM in order to let vsx0 user do super-user's actions without asking for password. The details haven't been explored, but this failure doesn't appear if the test has been runned without DTK Manager.
/tset/lsb_release/testcases/lsb_release/lsb_release-tc 2 	Failed 	
Messages from the test

Reference 15.2, The lsb_release command should return the version of LSB against which the distribution is compliant.
Spec reference: 15.2. Command Behavior
Expecting at least 2 core-3.2 results from lsb_release
exit code 1 returned, expected 0
/tset/LSB.usersgroups/usersgroups/names/names-tc 6 	Warning 	
Messages from the test

Reference User & Group Names 16-1
If User Name (sync) exists it should be in the Group (sync)
WARNING: User Name (sync) is in the wrong group (root).
/tset/LSB.usersgroups/usersgroups/names/names-tc 7 	Warning 	
Messages from the test

Reference User & Group Names 16-1
If User Name (shutdown) exists it should be in the Group (shutdown)
WARNING: User Name (shutdown) is in the wrong group (root).
/tset/LSB.usersgroups/usersgroups/names/names-tc 8 	Warning 	
Messages from the test

Reference User & Group Names 16-1
If User Name (halt) exists it should be in the Group (halt)
WARNING: User Name (halt) is in the wrong group (root).

Desktop-T2C Tests v 3.1.95-3

/atk-t2c/tests/AtkObject_properties/AtkObject_properties 4 	Failed (quelled) 	Known problem (waived)
Messages from the test

Target interface(s):
accessible_role
--------
Checked requirements: accessible_role.01
Checked requirements: accessible_role.02
Checked requirements: accessible_role.03
Checked requirements: accessible_role.05
Initial value of the role is 66, but should be 0.
Value of the property should be 0 just after creation of an object.

Requirement failed:
{accessible_role.05}
Default value: 0
Comment:
This failure occurs due to the following problem:
"accessible-role" - invalid default value.
Detailed description of this problem is available here.
/atk-t2c/tests/AtkObject_properties/AtkObject_properties 16 	Failed (quelled) 	Known problem (waived)
Messages from the test

Target interface(s):
accessible_value
--------
Value = 10.000000 was passed to function g_object_set().
But after call of the function g_object_get,
value, address of which was passed to it, contains 0.000000.
g_object_get() should return same value, as set by g_object_set().

Requirement failed:
{accessible_value.02}
Type of property should be gdouble. Property should be readable and writable.
Comment:
This failure occurs due to the following problem:
Spurious gdouble in "accesible-value" property of an AtkObject.
Detailed description of this problem is available here.
/atk-t2c/tests/AtkObject_signals/AtkObject_signals 16 	Failed (quelled) 	Known problem (waived)
Messages from the test

Target interface(s):
property_change
--------
Property 'accessible-role' has changed it's value from 66 to 2
The signal "property-change" should be emitted when an object's property value changes.

Requirement failed:
{property_change.04}
The signal "property-change" should be emitted when an object's property value changes.
Comment:
This failure occurs due to the following problem:
"property-change" signal is not always emitted when the value of the "accessible-role" property changes.
Detailed description of this problem is available here.
/atk-t2c/tests/AtkObject_relation/AtkObject_relation 6 	Failed (quelled) 	Known problem (waived)
Messages from the test

Target interface(s):
atk_object_remove_relationship
--------
Checked requirements: app.atk_object_remove_relationship.03
Checked requirements: app.atk_object_remove_relationship.04
Checked requirements: app.atk_object_remove_relationship.05
Checked requirements: atk_object_remove_relationship.02
Checked requirements: atk_object_remove_relationship.01
Before call of the function there were 5 relationships(total).
After call - 3.
Function shouldn't delete other relationships

Requirement failed:
{atk_object_remove_relationship.01}
Removes a relationship of the specified type with the specified target.
Comment:
This failure occurs due to the following problem:
atk_object_remove_relationship can remove more relationships than it should.
Detailed description of this problem is available here.
/atk-t2c/tests/AtkObject_relation/AtkObject_relation 7 	Failed (quelled) 	Known problem (waived)
Messages from the test

Target interface(s):
atk_object_remove_relationship
--------
Checked requirements: app.atk_object_remove_relationship.03
Checked requirements: app.atk_object_remove_relationship.04
Checked requirements: app.atk_object_remove_relationship.05
Checked requirements: atk_object_remove_relationship.02
Checked requirements: atk_object_remove_relationship.01
Before call of the function there were 5 relationships(total).
After call - 3.
Function shouldn't delete other relationships

Requirement failed:
{atk_object_remove_relationship.01}
Removes a relationship of the specified type with the specified target.
Comment:
This failure occurs due to the following problem:
atk_object_remove_relationship can remove more relationships than it should.
Detailed description of this problem is available here.
/atk-t2c/tests/AtkStateSet/AtkStateSet 24 	Failed (quelled) 	Known problem (waived)
Messages from the test

Target interface(s):
atk_state_set_or_sets
--------
When called for empty sets, the function should return NULL.
But it returned 0x9ffd948.

Requirement failed:
{atk_state_set_or_sets.01.02}
returns NULL if the union is empty.
Comment:
This failure occurs due to the following problem:
atk_state_set_or_sets returns an empty set rather than NULL.
Detailed description of this problem is available here.
/atk-t2c/tests/AtkRelationSet/AtkRelationSet 10 	Failed (quelled) 	Known problem (waived)
Messages from the test

Target interface(s):
atk_relation_set_add
--------
Checked requirements: app.atk_relation_set_add.02
Checked requirements: app.atk_relation_set_add.03
Initial set contained the following relations:
0x9f12320,
0x9f12308.
And the function was called with relation = 0x9f12320,
which was in the set
After call of the function the set is expected to contain the following:
0x9f12320,
0x9f12308.
And it contains the following:
0x9f12320,
0x9f12320,
0x9f12308.
Function should not add a relation to the set if the relation is already present in it.

Requirement failed:
{atk_relation_set_add.01}
Add a new relation to the current relation set if it is not already present.
Comment:
This failure occurs due to the following problem:
atk_relation_set_add always adds relation to the set.
Detailed description of this problem is available here.
/atk-t2c/tests/AtkUtils/AtkUtils 5 	Failed (quelled) 	Known problem (waived)
Messages from the test

Target interface(s):
atk_add_global_event_listener
--------
Function returns 4294967295 (-1)
Function should return 0 on failure.

Requirement failed:
{atk_add_global_event_listener.02.02}
Returns 0 on failure.
Comment:
This failure occurs due to the following problem:
atk_add_global_event_listener, atk_add_key_event_listener return incorrect value in case of error.
Detailed description of this problem is available here.
/atk-t2c/tests/AtkUtils/AtkUtils 8 	Failed (quelled) 	Known problem (waived)
Messages from the test

Target interface(s):
atk_add_key_event_listener
--------
Function returns 4294967295 (-1)
The function should return 0 on failure.

Requirement failed:
{atk_add_key_event_listener.03.02}
Returns 0 on failure.
Comment:
This failure occurs due to the following problem:
atk_add_global_event_listener, atk_add_key_event_listener return incorrect value in case of error.
Detailed description of this problem is available here.
/atk-t2c/tests/AtkHyperlink/AtkHyperlink 19 	Failed (quelled) 	Known problem (waived)
Messages from the test

Target interface(s):
start_index
--------
Property "start-index" has value 20,
but function atk_hyperlink_get_start_index returned 10.
Value of property should coincide with value returned by atk_hyperlink_get_start_index.

Requirement failed:
{start_index.05}
Property means the start index of the AtkHyperlink object.
Comment:
This failure occurs due to the following problem:
Incorrect registration of the "start-index" property for AtkHyperlink.
Detailed description of this problem is available here.
/glib-t2c/tests/glib_key_parser/glib_key_parser 36 	Failed (quelled) 	Known problem (waived)
Messages from the test

Target interface(s):
g_key_file_has_key
--------
Checked requirements: g_key_file_new.01
Error reported in glib_key_parser.c, line 5038
comment: [g_key_file_has_key: assertion `group_name != NULL' failed]
Checked requirements: g_key_file_has_key.03
Returned value should be TRUE.

At least one of the following requirements failed:

{g_key_file_has_key.02}
If group_name is NULL, the start group is used.

{g_key_file_has_key.01.01}
Returns TRUE if key is a part of group_name.
Comment:
This failure occurs due to the following problem:
Inconsistency between standard and implementation "g_key_file_has_key".
Detailed description of this problem is available here.
/glib-t2c/tests/glib_key_parser/glib_key_parser 60 	Failed (quelled) 	Known problem (waived)
Messages from the test

Target interface(s):
g_key_file_get_boolean
--------
Checked requirements: g_key_file_new.01
Error reported in glib_key_parser.c, line 9100
comment: [g_key_file_get_boolean: assertion `group_name != NULL' failed]
returned value is FALSE, should be TRUE

At least one of the following requirements failed:

{g_key_file_get_boolean.04}
If group_name is NULL, the start group is used.

{g_key_file_get_boolean.01}
Returns the value associated with key under group_name as a boolean.
Comment:
This failure occurs due to the following problem:
Inconsistency between standard and implementation of the interface "g_key_file_get_boolean".
Detailed description of this problem is available here.
/glib-t2c/tests/glib_key_parser/glib_key_parser 64 	Failed (quelled) 	Known problem (waived)
Messages from the test

Target interface(s):
g_key_file_get_integer
--------
Checked requirements: g_key_file_new.01
Error reported in glib_key_parser.c, line 9608
comment: [g_key_file_get_integer: assertion `group_name != NULL' failed]
Returned incorrect value.

At least one of the following requirements failed:

{g_key_file_get_integer.04}
If group_name is NULL, the start_group is used.

{g_key_file_get_integer.01}
Returns the value associated with key under group_name as an integer.
Comment:
This failure occurs due to the following problem:
Inconsistency between standard and implementation of the interface "g_key_file_get_integer".
Detailed description of this problem is available here.
/glib-t2c/tests/glib_key_parser/glib_key_parser 76 	Failed (quelled) 	Known problem (waived)
Messages from the test

Target interface(s):
g_key_file_get_locale_string_list
--------
Checked requirements: g_key_file_new.01
Error reported in glib_key_parser.c, line 12403
comment: [g_key_file_get_locale_string_list: assertion `group_name != NULL' failed]
Returned NULL.

At least one of the following requirements failed:

{g_key_file_get_locale_string_list.07}
The default list separator is ';'.

{g_key_file_get_locale_string_list.01}
Returns the values associated with key under group_name translated in the given locale if available.

{g_key_file_get_locale_string_list.08}
If group_name is NULL, then the start group is used.
Comment:
This failure occurs due to the following problem:
Inconsistency between standard and implementation of the interface "g_key_file_get_locale_string_list".
Detailed description of this problem is available here.
/glib-t2c/tests/glib_key_parser/glib_key_parser 83 	Failed (quelled) 	Known problem (waived)
Messages from the test

Target interface(s):
g_key_file_get_boolean_list
--------
Checked requirements: g_key_file_new.01
Error reported in glib_key_parser.c, line 14163
comment: [g_key_file_get_boolean_list: assertion `group_name != NULL' failed]
Returned value is NULL.

At least one of the following requirements failed:

{g_key_file_get_boolean_list.06}
If group_name is NULL, the start_group is used.

{g_key_file_get_boolean_list.05}
The default list separator is ';'.

{g_key_file_get_boolean_list.01}
Returns the values associated with key under group_name as booleans.
Comment:
This failure occurs due to the following problem:
Inconsistency between standard and implementation of the interface "g_key_file_get_boolean_list".
Detailed description of this problem is available here.
/glib-t2c/tests/glib_key_parser/glib_key_parser 87 	Failed (quelled) 	Known problem (waived)
Messages from the test

Target interface(s):
g_key_file_get_integer_list
--------
Checked requirements: g_key_file_new.01
Error reported in glib_key_parser.c, line 14934
comment: [g_key_file_get_integer_list: assertion `group_name != NULL' failed]
Returned value is NULL.

At least one of the following requirements failed:

{g_key_file_get_integer_list.05}
The default list separator is ';'.

{g_key_file_get_integer_list.04}
the number of integers returned

{g_key_file_get_integer_list.06}
If group_name is NULL, the start group is used.

{g_key_file_get_integer_list.01}
Returns the values associated with key under group_name as integers.
Comment:
This failure occurs due to the following problem:
Inconsistency between standard and implementation of the interface "g_key_file_get_integer_list".
Detailed description of this problem is available here.
/glib-t2c/tests/glib_key_parser/glib_key_parser 88 	Failed (quelled) 	Known problem (waived)
Messages from the test

Target interface(s):
g_key_file_get_comment
--------
Checked requirements: g_key_file_new.01
Checked requirements: g_key_file_get_comment.04
get comment failed: expected value = "Fourth Comment", returned value = "Fourth Comment
"

Requirement failed:
{g_key_file_get_comment.01}
Retrieves a comment above key from group_name.
Comment:
This failure occurs due to the following problem:
The "g_key_file_get_comment" interface returns comment with unexpected new line symbol at the end.
Detailed description of this problem is available here.
/glib-t2c/tests/glib_key_parser/glib_key_parser 89 	Failed (quelled) 	Known problem (waived)
Messages from the test

Target interface(s):
g_key_file_get_comment
--------
Checked requirements: g_key_file_new.01
Checked requirements: g_key_file_get_comment.04
get comment from above group failed: expected value = "Third Comment", returned value = "Third Comment
"

Requirement failed:
{g_key_file_get_comment.02}
If key is NULL then comment will be read from above group_name.
Comment:
This failure occurs due to the following problem:
The "g_key_file_get_comment" interface returns comment with unexpected new line symbol at the end.
Detailed description of this problem is available here.
/glib-t2c/tests/glib_key_parser/glib_key_parser 90 	Failed (quelled) 	Known problem (waived)
Messages from the test

Target interface(s):
g_key_file_get_comment
--------
Checked requirements: g_key_file_new.01
Checked requirements: g_key_file_get_comment.04
get comment from above first group failed: expected value = "First Comment", returned value = "First Comment
"

Requirement failed:
{g_key_file_get_comment.03}
If both key and group_name are NULL, then comment will be read from above the first group in the file.
Comment:
This failure occurs due to the following problem:
The "g_key_file_get_comment" interface returns comment with unexpected new line symbol at the end.
Detailed description of this problem is available here.
/glib-t2c/tests/glib_key_parser/glib_key_parser 101 	Failed (quelled) 	Known problem (waived)
Messages from the test

Target interface(s):
g_key_file_set_boolean
--------
Checked requirements: g_key_file_new.01
Error reported in glib_key_parser.c, line 16864
comment: [g_key_file_get_boolean: assertion `group_name != NULL' failed]
Set boolean value = TRUE, while Get FALSE.

At least one of the following requirements failed:

{g_key_file_set_boolean.03}
If group_name is NULL, the start group is used.

{g_key_file_get_boolean.04}
If group_name is NULL, the start group is used.
Comment:
This failure occurs due to the following problem:
Inconsistency between standard and implementation of the interface "g_key_file_set_boolean".
Detailed description of this problem is available here.
/glib-t2c/tests/glib_key_parser/glib_key_parser 104 	Failed (quelled) 	Known problem (waived)
Messages from the test

Target interface(s):
g_key_file_set_integer
--------
Checked requirements: g_key_file_new.01
Error reported in glib_key_parser.c, line 17195
comment: [g_key_file_set_integer: assertion `group_name != NULL' failed]
Set integer value = "15", while Get integer = "-1".

At least one of the following requirements failed:

{g_key_file_set_integer.03}
If group_name is NULL, the start group is used.

{g_key_file_get_integer.04}
If group_name is NULL, the start_group is used.

{g_key_file_set_integer.01}
Associates a new integer value with key under group_name.
Comment:
This failure occurs due to the following problem:
Inconsistency between standard and implementation "g_key_file_set_integer".
Detailed description of this problem is available here.
/glib-t2c/tests/glib_key_parser/glib_key_parser 110 	Failed (quelled) 	Known problem (waived)
Messages from the test

Target interface(s):
g_key_file_set_locale_string_list
--------
Checked requirements: g_key_file_new.01
Error reported in glib_key_parser.c, line 18247
comment: [g_key_file_set_locale_string_list: assertion `group_name != NULL' failed]
Get returns NULL for Key = "Welcome" and Locale = "en" of the Group = "(null)", while Set filled the list.

At least one of the following requirements failed:

{g_key_file_set_locale_string_list.03}
If group_name is NULL, the start group is used.

{g_key_file_get_locale_string_list.07}
The default list separator is ';'.

{g_key_file_get_locale_string_list.08}
If group_name is NULL, then the start group is used.

{g_key_file_set_locale_string_list.01}
Associates a list of string values for key and locale under group_name.
Comment:
This failure occurs due to the following problem:
Inconsistency between standard and implementation "g_key_file_set_locale_string_list".
Detailed description of this problem is available here.
/glib-t2c/tests/glib_key_parser/glib_key_parser 113 	Failed (quelled) 	Known problem (waived)
Messages from the test

Target interface(s):
g_key_file_set_boolean_list
--------
Checked requirements: g_key_file_new.01
Error reported in glib_key_parser.c, line 18764
comment: [g_key_file_set_boolean_list: assertion `group_name != NULL' failed]
Get returns NULL for Key = "BooleanList" of the Group = "(null)", while Set filled the list.

At least one of the following requirements failed:

{g_key_file_set_boolean_list.03}
If group_name is NULL, the start_group is used.

{g_key_file_get_boolean_list.06}
If group_name is NULL, the start_group is used.

{g_key_file_set_boolean_list.01}
Associates a list of boolean values with key under group_name.
Comment:
This failure occurs due to the following problem:
Inconsistency between standard and implementation of the interface "g_key_file_set_boolean_list".
Detailed description of this problem is available here.
/glib-t2c/tests/glib_key_parser/glib_key_parser 116 	Failed (quelled) 	Known problem (waived)
Messages from the test

Target interface(s):
g_key_file_set_integer_list
--------
Checked requirements: g_key_file_new.01
Error reported in glib_key_parser.c, line 19338
comment: [g_key_file_set_integer_list: assertion `group_name != NULL' failed]
Get returns NULL for Key = "Numbers" of the Group = "First Group", while Set filled the list.

At least one of the following requirements failed:

{g_key_file_set_integer_list.03}
If group_name is NULL the start group is used.

{g_key_file_get_integer_list.06}
If group_name is NULL, the start group is used.

{g_key_file_set_integer_list.01}
Associates a list of integer values with key under group_name.
Comment:
This failure occurs due to the following problem:
Inconsistency between standard and implementation "g_key_file_set_integer_list".
Detailed description of this problem is available here.
/glib-t2c/tests/glib_key_parser/glib_key_parser 117 	Failed (quelled) 	Known problem (waived)
Messages from the test

Target interface(s):
g_key_file_set_comment
g_key_file_get_comment
--------
Checked requirements: g_key_file_new.01
Checked requirements: g_key_file_set_comment.04
Trying to set comment: set comment = "comment 1" get comment = "comment 1
"

At least one of the following requirements failed:

{g_key_file_set_comment.01}
Places a comment above key from group_name.

{g_key_file_get_comment.01}
Retrieves a comment above key from group_name.
Comment:
This failure occurs due to the following problem:
The "g_key_file_get_comment" interface returns comment with unexpected new line symbol at the end.
Detailed description of this problem is available here.
/glib-t2c/tests/glib_key_parser/glib_key_parser 118 	Failed (quelled) 	Known problem (waived)
Messages from the test

Target interface(s):
g_key_file_set_comment
g_key_file_get_comment
--------
Checked requirements: g_key_file_new.01
Checked requirements: g_key_file_set_comment.04
Trying to set comment above the group: set comment = "comment 2" get comment = "#comment 2"

At least one of the following requirements failed:

{g_key_file_set_comment.02}
If key is NULL then comment will be written above group_name.

{g_key_file_get_comment.02}
If key is NULL then comment will be read from above group_name.
Comment:
This failure occurs due to the following problem:
The "g_key_file_set_comment" interface prepends '#' character to the comment.
Detailed description of this problem is available here.
/glib-t2c/tests/glib_key_parser/glib_key_parser 119 	Failed (quelled) 	Known problem (waived)
Messages from the test

Target interface(s):
g_key_file_set_comment
g_key_file_get_comment
--------
Checked requirements: g_key_file_new.01
Checked requirements: g_key_file_set_comment.04
Trying to set comment above the first group: set comment = "comment 3" get comment = "comment 3
"

At least one of the following requirements failed:

{g_key_file_set_comment.03}
If both key and group_name are NULL, then comment will be written above the first group in the file.

{g_key_file_get_comment.03}
If both key and group_name are NULL, then comment will be read from above the first group in the file.
Comment:
This failure occurs due to the following problem:
The "g_key_file_get_comment" interface returns comment with unexpected new line symbol at the end.
Detailed description of this problem is available here.
/glib-t2c/tests/glib_key_parser/glib_key_parser 125 	Failed (quelled) 	Known problem (waived)
Messages from the test

Target interface(s):
g_key_file_remove_comment
--------
Checked requirements: g_key_file_new.01
Checked requirements: g_key_file_remove_comment.04
Comment above the Group = "Second Group" not removed , Get comment should be NULL, now is "Third Comment
".

Requirement failed:
{g_key_file_remove_comment.02}
If key is NULL then comment will be removed above group_name.
Comment:
This failure occurs due to the following problem:
Invocation of the interface "g_key_file_remove_comment" does not remove comment in specific case.
Detailed description of this problem is available here.
/glib-t2c/tests/glib_memchunks/glib_memchunks 9 	Failed (quelled) 	Known problem (waived)
Messages from the test

Target interface(s):
g_mem_chunk_print
g_mem_chunk_info
--------
No print in log or GMemChunk name not found in message

Requirement failed:
{g_mem_chunk_info.01}
Outputs debugging information for all GMemChunk objects currently in use. It outputs the number of GMemChunk objects currently allocated, and calls g_mem_chunk_print() to output information on each one.
Comment:
Memory chunks are deprecated since glib version 2.10.
/glib-t2c/tests/glib_memchunks/glib_memchunks 10 	Failed (quelled) 	Known problem (waived)
Messages from the test

Target interface(s):
g_mem_chunk_print
g_mem_chunk_info
--------
No print in log or GMemChunk name not found in message

Requirement failed:
{g_mem_chunk_print.01}
Outputs debugging information for a GMemChunk. It outputs the name of the GMemChunk (set with g_mem_chunk_new()), the number of bytes used, and the number of blocks of memory allocated.
Comment:
Memory chunks are deprecated since glib version 2.10.
/glib-t2c/tests/glib_main_event_loop/glib_main_event_loop 46 	Failed (quelled) 	Known problem (waived)
Messages from the test

Target interface(s):
g_main_context_check
--------
g_main_context_check: sources with higher numerical priority than specified are being checked.

Requirement failed:
{g_main_context_check.01}
max_priority : the maximum numerical priority of sources to check
Comment:
This failure occurs due to the following problem:
The "g_main_context_check" interface ignores it's "max_priority" parameter.
Detailed description of this problem is available here.
/glib-t2c/tests/glib_hooks/glib_hooks 3 	Unresolved 	Known problem
Messages from the test

Target interface(s):
g_hook_free
--------
unexpected signal 11 (SIGSEGV) received
Comment:
This failure occurs due to the following problem:
Invocation of the interface "g_hook_free" fails in certain conditions.
Detailed description of this problem is available here.
/glib-t2c/tests/glib_unicode/glib_unicode 39 	Unresolved 	Known problem
Messages from the test

Target interface(s):
g_utf8_strreverse
--------
dataAvailable == 0
FAILED CHECK in glib_unicode.c, line 3482
comment: Child process calling 'g_utf8_strreverse' died unexpectedly.
Error: Test purpose error.
Comment:
This failure occurs due to the following problem:
Invocation of the interface "g_utf8_strreverse" crashes for certain input values.
Detailed description of this problem is available here.
/gmodule-t2c/tests/gmodule/gmodule 11 	Failed (quelled) 	Known problem (waived)
Messages from the test

Target interface(s):
g_module_open
--------
g_module_open cannot open module '/opt/lsb/test/desktop-t2c/gmodule-t2c/testdata/gmodule/open/la1/test.la'.

Requirement failed:
{g_module_open.01.01}
First of all g_module_open() tries to open file_name as a module.
Comment:
This failure occurs due to the following problem:
g_module_open fails to open modules with ".la" extension.
Detailed description of this problem is available here.
/gmodule-t2c/tests/gmodule/gmodule 23 	Failed (quelled) 	Known problem (waived)
Messages from the test

Target interface(s):
g_module_error
--------
A string meaning that no error occured is '(null)', current error string is '(null)'.
Error occurs in g_module_open, but g_module_error doesn't reveal it.

Requirement failed:
{g_module_error.01}
Returns :a string describing the last module error.
Comment:
This failure occurs due to the following problem:
g_module_error returns NULL after g_module_open has failed to open a module with ".la" extension.
Detailed description of this problem is available here.

LSB desktop test suites:

Desktop::GTK Tests v 3.1.95-5

/tests/functions/GdkImages/GdkImages 2 	Failed 	
test case: /opt/lsb/test/desktop/gtkvts/tet_tmp_dir/16738aa/tests/functions/GdkImages/GdkImages, TP number: 2
GdkImages.c, line 127:
gdk_image_new: it's not a GDK_TYPE_IMAGE

Desktop::Qt4 Tests v 3.1.95-5

tst_QDataWidgetMapper_mappedWidgetAt 7 	Failed 	
Compared pointers are not the same Actual (mapper.mappedWidgetAt(1)): 0xbf8edbac Expected (&lineEdit1): 0xbf8edbc0

tst_QHeaderView_moveSectionAndReset 38 	Failed 	
Compared values are not the same Actual (v.logicalIndex(v.visualIndex(i))): -1 Expected (i): 0

tst_QIcon_actualSize 1 	Failed 	
Compared values are not the same

tst_QIcon_actualSize2 2 	Failed 	
Compared values are not the same

tst_QIcon_isNull 3 	Failed 	
(none)

tst_QLabel_focusPolicy 13 	Failed 	
Compared values are not the same

tst_QListView_batchedMode 16 	Failed 	
Compared values are not the same Actual (ba.size()): 2 Expected (3): 3

tst_QStyleOption_qstyleoptioncast 1 	Failed 	
Compared values are not the same Actual (testOption->pointer->type): 0 Expected (type): 17

tst_QTableWidget_itemData 18 	Failed 	
Compared values are not the same Actual (flags.count()): 3 Expected (6): 6

tst_QTextDocumentFragment_html_rowSpans2 109 	Failed 	
Compared values are not the same Actual (table->cellAt(0, 1).rowSpan()): 3 Expected (1): 1

tst_QTextDocumentFragment_css_nodeNameCaseInsensitivity 123 	Failed 	
(none)

tst_QTextTable_splitCells 14 	Failed 	
(none)

== Perl Tests   v 3.1.95-3 ==
<pre>
../lib/Memoize/t/tie_ndbm.t 458 	Failed 	
(none)

../lib/Net/Ping/t/200_ping_tcp.t 473 	Failed 	
FAILED test 6 Failed 1/13 tests, 92.31% okay

../lib/Net/Ping/t/400_ping_syn.t 475 	Failed 	
FAILED test 19 Failed 1/19 tests, 94.74% okay

../lib/Net/Ping/t/410_syn_host.t 476 	Failed 	
FAILED test 13 Failed 1/19 tests, 94.74% okay

Printing Tests v 3.1.96-1

/convenience/cupsConvenience 21 	Failed 	
Test 21
When cupsLangDefault is called, the function returns the default language data
cupsLangDefault returned 'c_', expected 'C'

/convenience/cupsConvenience 25 	Failed 	
Test 25
When cupsLangGet is called, the function returns language data for the requested language
cupsLangGet returned 'fr_', expected 'fr'

Python Runtime Tests v 3.1.95-3

/usr/bin/python 21 	Failed 	
errors occurred; run in verbose mode for details

X11 Tests (XTS5) v 5.1.5-4

/tset/Xproto/allcclrcll/Test 3 	Unresolved 	
Messages from the test

VSW5TESTSUITE PURPOSE 3
Assertion AllocColorCells-3.(B)
When a client sends an invalid AllocColorCells protocol
request to the X server, in which the length field of the
request exceeds the maximum length accepted by the X server,
then the X server sends back a BadLength error to the
client.
Reason for omission: There is no known portable test method for this assertion
METH: Call library function testfunc() to do the following:
METH: Open a connection to the X server using native byte sex.
METH: Create colourmap with alloc set to AllocNone.
METH: Send an invalid AllocColorCells protocol request to the X server with length
METH: one greater than the maximum length accepted by the server.
METH: Verify that the X server sends back a BadLength error.
METH: Open a connection to the X server using reversed byte sex.
METH: Create colourmap with alloc set to AllocNone.
METH: Send an invalid AllocColorCells protocol request to the X server with length
METH: one greater than the maximum length accepted by the server.
METH: Verify that the X server sends back a BadLength error.
TRACE: About to test with Native byte-sex (MSB)
TRACE: client 0 sent default CreateWindow for window 4194304
TRACE: client 0 sent CreateColormap for colormap 4194305
INFO: Processing a big request
child process was terminated by signal 13 (SIGPIPE)
CHECK: AllocColorCells-3 1, line 327
/tset/Xproto/allcnmdclr/Test 3 	Unresolved 	
Messages from the test

VSW5TESTSUITE PURPOSE 3
Assertion AllocNamedColor-3.(B)
When a client sends an invalid AllocNamedColor protocol
request to the X server, in which the length field of the
request exceeds the maximum length accepted by the X server,
then the X server sends back a BadLength error to the
client.
Reason for omission: There is no known portable test method for this assertion
METH: Call library function testfunc() to do the following:
METH: Open a connection to the X server using native byte sex.
METH: Create colourmap with alloc set to AllocNone.
METH: Send an invalid AllocNamedColor protocol request to the X server with length
METH: one greater than the maximum length accepted by the server.
METH: Verify that the X server sends back a BadLength error.
METH: Open a connection to the X server using reversed byte sex.
METH: Create colourmap with alloc set to AllocNone.
METH: Send an invalid AllocNamedColor protocol request to the X server with length
METH: one greater than the maximum length accepted by the server.
METH: Verify that the X server sends back a BadLength error.
TRACE: About to test with Native byte-sex (MSB)
TRACE: client 0 sent default CreateWindow for window 4194304
TRACE: client 0 sent CreateColormap for colormap 4194305
INFO: Processing a big request
child process was terminated by signal 13 (SIGPIPE)
CHECK: AllocNamedColor-3 1, line 327
/tset/Xproto/chnggc/Test 3 	Unresolved 	
Messages from the test

VSW5TESTSUITE PURPOSE 3
Assertion ChangeGC-3.(B)
When a client sends an invalid ChangeGC protocol request to
the X server, in which the length field of the request
exceeds the maximum length accepted by the X server, then
the X server sends back a BadLength error to the client.
Reason for omission: There is no known portable test method for this assertion
METH: Call library function testfunc() to do the following:
METH: Open a connection to the X server using native byte sex.
METH: Send an invalid ChangeGC protocol request to the X server with length
METH: one greater than the maximum length accepted by the server.
METH: Verify that the X server sends back a BadLength error.
METH: Open a connection to the X server using reversed byte sex.
METH: Send an invalid ChangeGC protocol request to the X server with length
METH: one greater than the maximum length accepted by the server.
METH: Verify that the X server sends back a BadLength error.
TRACE: About to test with Native byte-sex (MSB)
TRACE: client 0 sent default CreateWindow for window 4194304
TRACE: client 0 sent default CreateGC request
INFO: Processing a big request
child process was terminated by signal 13 (SIGPIPE)
CHECK: ChangeGC-3 1, line 327
/tset/Xproto/chngpntrcn/Test 3 	Unresolved 	
Messages from the test

VSW5TESTSUITE PURPOSE 3
Assertion ChangePointerControl-3.(B)
When a client sends an invalid ChangePointerControl
protocol request to the X server, in which the length field
of the request exceeds the maximum length accepted by the X
server, then the X server sends back a BadLength error to
the client.
Reason for omission: There is no known portable test method for this assertion
METH: Call library function testfunc() to do the following:
METH: Open a connection to the X server using native byte sex.
METH: Send an invalid ChangePointerControl protocol request to the X server with length
METH: one greater than the maximum length accepted by the server.
METH: Verify that the X server sends back a BadLength error.
METH: Open a connection to the X server using reversed byte sex.
METH: Send an invalid ChangePointerControl protocol request to the X server with length
METH: one greater than the maximum length accepted by the server.
METH: Verify that the X server sends back a BadLength error.
TRACE: About to test with Native byte-sex (MSB)
TRACE: client 0 sent default GetPointerControl request
TRACE: client 0 received GetPointerControl reply
INFO: Processing a big request
child process was terminated by signal 13 (SIGPIPE)
CHECK: ChangePointerControl-3 1, line 327
/tset/Xproto/chngwdwatt/Test 3 	Unresolved 	
Messages from the test

VSW5TESTSUITE PURPOSE 3
Assertion ChangeWindowAttributes-3.(B)
When a client sends an invalid ChangeWindowAttributes
protocol request to the X server, in which the length field
of the request exceeds the maximum length accepted by the X
server, then the X server sends back a BadLength error to
the client.
Reason for omission: There is no known portable test method for this assertion
METH: Call library function testfunc() to do the following:
METH: Open a connection to the X server using native byte sex.
METH: Send an invalid ChangeWindowAttributes protocol request to the X server with length
METH: one greater than the maximum length accepted by the server.
METH: Verify that the X server sends back a BadLength error.
METH: Open a connection to the X server using reversed byte sex.
METH: Send an invalid ChangeWindowAttributes protocol request to the X server with length
METH: one greater than the maximum length accepted by the server.
METH: Verify that the X server sends back a BadLength error.
TRACE: About to test with Native byte-sex (MSB)
TRACE: client 0 sent default CreateWindow for window 4194304
INFO: Processing a big request
child process was terminated by signal 13 (SIGPIPE)
CHECK: ChangeWindowAttributes-3 1, line 327
/tset/Xproto/clsfnt/Test 3 	Unresolved 	
Messages from the test

VSW5TESTSUITE PURPOSE 3
Assertion CloseFont-3.(B)
When a client sends an invalid CloseFont protocol request
to the X server, in which the length field of the request
exceeds the maximum length accepted by the X server, then
the X server sends back a BadLength error to the client.
Reason for omission: There is no known portable test method for this assertion
METH: Call library function testfunc() to do the following:
METH: Open a connection to the X server using native byte sex.
METH: Send an invalid CloseFont protocol request to the X server with length
METH: one greater than the maximum length accepted by the server.
METH: Verify that the X server sends back a BadLength error.
METH: Open a connection to the X server using reversed byte sex.
METH: Send an invalid CloseFont protocol request to the X server with length
METH: one greater than the maximum length accepted by the server.
METH: Verify that the X server sends back a BadLength error.
TRACE: client 7 sent startup GetFontPath request
TRACE: client 7 received startup GetFontPath reply
TRACE: Server's initial fontpath was '/opt/lsb/test/lsb-xts5/xts5/fonts,/opt/lsb/share/fonts/misc'
TRACE: client 7 sent startup SetFontPath request
TRACE: About to test with Native byte-sex (MSB)
TRACE: client 0 sent default OpenFont request
INFO: Processing a big request
child process was terminated by signal 13 (SIGPIPE)
CHECK: CloseFont-3 1, line 327
TRACE: client 7 sent startup SetFontPath request
/tset/Xproto/cnvrtslctn/Test 3 	Unresolved 	
Messages from the test

VSW5TESTSUITE PURPOSE 3
Assertion ConvertSelection-3.(B)
When a client sends an invalid ConvertSelection protocol
request to the X server, in which the length field of the
request exceeds the maximum length accepted by the X server,
then the X server sends back a BadLength error to the
client.
Reason for omission: There is no known portable test method for this assertion
METH: Call library function testfunc() to do the following:
METH: Open a connection to the X server using native byte sex.
METH: Send an invalid ConvertSelection protocol request to the X server with length
METH: one greater than the maximum length accepted by the server.
METH: Verify that the X server sends back a BadLength error.
METH: Open a connection to the X server using reversed byte sex.
METH: Send an invalid ConvertSelection protocol request to the X server with length
METH: one greater than the maximum length accepted by the server.
METH: Verify that the X server sends back a BadLength error.
TRACE: About to test with Native byte-sex (MSB)
TRACE: client 0 sent default CreateWindow for window 4194304
TRACE: client 0 sent default InternAtom request
TRACE: client 0 received InternAtom reply
INFO: Processing a big request
child process was terminated by signal 13 (SIGPIPE)
CHECK: ConvertSelection-3 1, line 327
/tset/Xproto/cpyclrmpan/Test 3 	Unresolved 	
Messages from the test

VSW5TESTSUITE PURPOSE 3
Assertion CopyColormapAndFree-3.(B)
When a client sends an invalid CopyColormapAndFree protocol
request to the X server, in which the length field of the
request exceeds the maximum length accepted by the X server,
then the X server sends back a BadLength error to the
client.
Reason for omission: There is no known portable test method for this assertion
METH: Call library function testfunc() to do the following:
METH: Open a connection to the X server using native byte sex.
METH: Send an invalid CopyColormapAndFree protocol request to the X server with length
METH: one greater than the maximum length accepted by the server.
METH: Verify that the X server sends back a BadLength error.
METH: Open a connection to the X server using reversed byte sex.
METH: Send an invalid CopyColormapAndFree protocol request to the X server with length
METH: one greater than the maximum length accepted by the server.
METH: Verify that the X server sends back a BadLength error.
TRACE: About to test with Native byte-sex (MSB)
TRACE: client 0 sent default CreateWindow for window 4194304
TRACE: client 0 sent CreateColormap for colormap 4194305
INFO: Processing a big request
child process was terminated by signal 13 (SIGPIPE)
CHECK: CopyColormapAndFree-3 1, line 327
/tset/Xproto/crtclrmp/Test 3 	Unresolved 	
Messages from the test

VSW5TESTSUITE PURPOSE 3
Assertion CreateColormap-3.(B)
When a client sends an invalid CreateColormap protocol
request to the X server, in which the length field of the
request exceeds the maximum length accepted by the X server,
then the X server sends back a BadLength error to the
client.
Reason for omission: There is no known portable test method for this assertion
METH: Call library function testfunc() to do the following:
METH: Open a connection to the X server using native byte sex.
METH: Send an invalid CreateColormap protocol request to the X server with length
METH: one greater than the maximum length accepted by the server.
METH: Verify that the X server sends back a BadLength error.
METH: Open a connection to the X server using reversed byte sex.
METH: Send an invalid CreateColormap protocol request to the X server with length
METH: one greater than the maximum length accepted by the server.
METH: Verify that the X server sends back a BadLength error.
TRACE: About to test with Native byte-sex (MSB)
TRACE: client 0 sent default CreateWindow for window 4194304
INFO: Processing a big request
child process was terminated by signal 13 (SIGPIPE)
CHECK: CreateColormap-3 1, line 327
/tset/Xproto/crtglyphcr/Test 3 	Unresolved 	
Messages from the test

VSW5TESTSUITE PURPOSE 3
Assertion CreateGlyphCursor-3.(B)
When a client sends an invalid CreateGlyphCursor protocol
request to the X server, in which the length field of the
request exceeds the maximum length accepted by the X server,
then the X server sends back a BadLength error to the
client.
Reason for omission: There is no known portable test method for this assertion
METH: Call library function testfunc() to do the following:
METH: Open a connection to the X server using native byte sex.
METH: Send an invalid CreateGlyphCursor protocol request to the X server with length
METH: one greater than the maximum length accepted by the server.
METH: Verify that the X server sends back a BadLength error.
METH: Open a connection to the X server using reversed byte sex.
METH: Send an invalid CreateGlyphCursor protocol request to the X server with length
METH: one greater than the maximum length accepted by the server.
METH: Verify that the X server sends back a BadLength error.
TRACE: client 7 sent startup GetFontPath request
TRACE: client 7 received startup GetFontPath reply
TRACE: Server's initial fontpath was '/opt/lsb/test/lsb-xts5/xts5/fonts,/opt/lsb/share/fonts/misc'
TRACE: client 7 sent startup SetFontPath request
TRACE: About to test with Native byte-sex (MSB)
TRACE: client 0 sent default CreateWindow for window 6291456
TRACE: client 0 sent default OpenFont request
INFO: Processing a big request
child process was terminated by signal 13 (SIGPIPE)
CHECK: CreateGlyphCursor-3 1, line 327
TRACE: client 7 sent startup SetFontPath request
/tset/Xproto/crtwdw/Test 3 	Unresolved 	
Messages from the test

VSW5TESTSUITE PURPOSE 3
Assertion CreateWindow-3.(B)
When a client sends an invalid CreateWindow protocol
request to the X server, in which the length field of the
request exceeds the maximum length accepted by the X server,
then the X server sends back a BadLength error to the
client.
Reason for omission: There is no known portable test method for this assertion
METH: Call library function testfunc() to do the following:
METH: Open a connection to the X server using native byte sex.
METH: Send an invalid CreateWindow protocol request to the X server with length
METH: one greater than the maximum length accepted by the server.
METH: Verify that the X server sends back a BadLength error.
METH: Open a connection to the X server using reversed byte sex.
METH: Send an invalid CreateWindow protocol request to the X server with length
METH: one greater than the maximum length accepted by the server.
METH: Verify that the X server sends back a BadLength error.
TRACE: About to test with Native byte-sex (MSB)
TRACE: client 0 sent default CreateWindow for window 4194304
INFO: Processing a big request
child process was terminated by signal 13 (SIGPIPE)
CHECK: CreateWindow-3 1, line 327
/tset/Xproto/dstrysbws/Test 3 	Unresolved 	
Messages from the test

VSW5TESTSUITE PURPOSE 3
Assertion DestroySubwindows-3.(B)
When a client sends an invalid DestroySubwindows protocol
request to the X server, in which the length field of the
request exceeds the maximum length accepted by the X server,
then the X server sends back a BadLength error to the
client.
Reason for omission: There is no known portable test method for this assertion
METH: Call library function testfunc() to do the following:
METH: Open a connection to the X server using native byte sex.
METH: Send an invalid DestroySubwindows protocol request to the X server with length
METH: one greater than the maximum length accepted by the server.
METH: Verify that the X server sends back a BadLength error.
METH: Open a connection to the X server using reversed byte sex.
METH: Send an invalid DestroySubwindows protocol request to the X server with length
METH: one greater than the maximum length accepted by the server.
METH: Verify that the X server sends back a BadLength error.
TRACE: About to test with Native byte-sex (MSB)
TRACE: client 0 sent default CreateWindow for window 4194304
TRACE: client 0 sent additional CreateWindow request
INFO: Processing a big request
child process was terminated by signal 13 (SIGPIPE)
CHECK: DestroySubwindows-3 1, line 327
/tset/Xproto/fllply/Test 3 	Unresolved 	
Messages from the test

VSW5TESTSUITE PURPOSE 3
Assertion FillPoly-3.(B)
When a client sends an invalid FillPoly protocol request to
the X server, in which the length field of the request
exceeds the maximum length accepted by the X server, then
the X server sends back a BadLength error to the client.
Reason for omission: There is no known portable test method for this assertion
METH: Call library function testfunc() to do the following:
METH: Open a connection to the X server using native byte sex.
METH: Send an invalid FillPoly protocol request to the X server with length
METH: one greater than the maximum length accepted by the server.
METH: Verify that the X server sends back a BadLength error.
METH: Open a connection to the X server using reversed byte sex.
METH: Send an invalid FillPoly protocol request to the X server with length
METH: one greater than the maximum length accepted by the server.
METH: Verify that the X server sends back a BadLength error.
TRACE: About to test with Native byte-sex (MSB)
TRACE: client 0 sent default CreateWindow for window 4194304
TRACE: client 0 sent default CreateGC request
TRACE: sent default MapWindow
TRACE: received an Expose event
INFO: Processing a big request
child process was terminated by signal 13 (SIGPIPE)
CHECK: FillPoly-3 1, line 327
/tset/Xproto/frcscrnsvr/Test 3 	Unresolved 	
Messages from the test

VSW5TESTSUITE PURPOSE 3
Assertion ForceScreenSaver-3.(B)
When a client sends an invalid ForceScreenSaver protocol
request to the X server, in which the length field of the
request exceeds the maximum length accepted by the X server,
then the X server sends back a BadLength error to the
client.
Reason for omission: There is no known portable test method for this assertion
METH: Call library function testfunc() to do the following:
METH: Open a connection to the X server using native byte sex.
METH: Send an invalid ForceScreenSaver protocol request to the X server with length
METH: one greater than the maximum length accepted by the server.
METH: Verify that the X server sends back a BadLength error.
METH: Open a connection to the X server using reversed byte sex.
METH: Send an invalid ForceScreenSaver protocol request to the X server with length
METH: one greater than the maximum length accepted by the server.
METH: Verify that the X server sends back a BadLength error.
TRACE: About to test with Native byte-sex (MSB)
INFO: Processing a big request
child process was terminated by signal 13 (SIGPIPE)
CHECK: ForceScreenSaver-3 1, line 327
/tset/Xproto/grbbttn/Test 3 	Unresolved 	
Messages from the test

VSW5TESTSUITE PURPOSE 3
Assertion GrabButton-3.(B)
When a client sends an invalid GrabButton protocol request
to the X server, in which the length field of the request
exceeds the maximum length accepted by the X server, then
the X server sends back a BadLength error to the client.
Reason for omission: There is no known portable test method for this assertion
METH: Call library function testfunc() to do the following:
METH: Open a connection to the X server using native byte sex.
METH: Send an invalid GrabButton protocol request to the X server with length
METH: one greater than the maximum length accepted by the server.
METH: Verify that the X server sends back a BadLength error.
METH: Open a connection to the X server using reversed byte sex.
METH: Send an invalid GrabButton protocol request to the X server with length
METH: one greater than the maximum length accepted by the server.
METH: Verify that the X server sends back a BadLength error.
TRACE: About to test with Native byte-sex (MSB)
TRACE: client 0 sent default CreateWindow for window 4194304
INFO: Processing a big request
child process was terminated by signal 13 (SIGPIPE)
CHECK: GrabButton-3 1, line 327
/tset/Xproto/grbkybrd/Test 3 	Unresolved 	
Messages from the test

VSW5TESTSUITE PURPOSE 3
Assertion GrabKeyboard-3.(B)
When a client sends an invalid GrabKeyboard protocol
request to the X server, in which the length field of the
request exceeds the maximum length accepted by the X server,
then the X server sends back a BadLength error to the
client.
Reason for omission: There is no known portable test method for this assertion
METH: Call library function testfunc() to do the following:
METH: Open a connection to the X server using native byte sex.
METH: Send an invalid GrabKeyboard protocol request to the X server with length
METH: one greater than the maximum length accepted by the server.
METH: Verify that the X server sends back a BadLength error.
METH: Open a connection to the X server using reversed byte sex.
METH: Send an invalid GrabKeyboard protocol request to the X server with length
METH: one greater than the maximum length accepted by the server.
METH: Verify that the X server sends back a BadLength error.
TRACE: About to test with Native byte-sex (MSB)
TRACE: client 0 sent default CreateWindow for window 4194304
INFO: Processing a big request
child process was terminated by signal 13 (SIGPIPE)
CHECK: GrabKeyboard-3 1, line 327
/tset/Xproto/gtatmnm/Test 3 	Unresolved 	
Messages from the test

VSW5TESTSUITE PURPOSE 3
Assertion GetAtomName-3.(B)
When a client sends an invalid GetAtomName protocol request
to the X server, in which the length field of the request
exceeds the maximum length accepted by the X server, then
the X server sends back a BadLength error to the client.
Reason for omission: There is no known portable test method for this assertion
METH: Call library function testfunc() to do the following:
METH: Open a connection to the X server using native byte sex.
METH: Send an invalid GetAtomName protocol request to the X server with length
METH: one greater than the maximum length accepted by the server.
METH: Verify that the X server sends back a BadLength error.
METH: Open a connection to the X server using reversed byte sex.
METH: Send an invalid GetAtomName protocol request to the X server with length
METH: one greater than the maximum length accepted by the server.
METH: Verify that the X server sends back a BadLength error.
TRACE: About to test with Native byte-sex (MSB)
INFO: Processing a big request
child process was terminated by signal 13 (SIGPIPE)
CHECK: GetAtomName-3 1, line 327
/tset/Xproto/gtgmtry/Test 3 	Unresolved 	
Messages from the test

VSW5TESTSUITE PURPOSE 3
Assertion GetGeometry-3.(B)
When a client sends an invalid GetGeometry protocol request
to the X server, in which the length field of the request
exceeds the maximum length accepted by the X server, then
the X server sends back a BadLength error to the client.
Reason for omission: There is no known portable test method for this assertion
METH: Call library function testfunc() to do the following:
METH: Open a connection to the X server using native byte sex.
METH: Send an invalid GetGeometry protocol request to the X server with length
METH: one greater than the maximum length accepted by the server.
METH: Verify that the X server sends back a BadLength error.
METH: Open a connection to the X server using reversed byte sex.
METH: Send an invalid GetGeometry protocol request to the X server with length
METH: one greater than the maximum length accepted by the server.
METH: Verify that the X server sends back a BadLength error.
TRACE: About to test with Native byte-sex (MSB)
TRACE: client 0 sent default CreateWindow for window 4194304
INFO: Processing a big request
child process was terminated by signal 13 (SIGPIPE)
CHECK: GetGeometry-3 1, line 327
/tset/Xproto/gtinptfcs/Test 3 	Unresolved 	
Messages from the test

VSW5TESTSUITE PURPOSE 3
Assertion GetInputFocus-3.(B)
When a client sends an invalid GetInputFocus protocol
request to the X server, in which the length field of the
request exceeds the maximum length accepted by the X server,
then the X server sends back a BadLength error to the
client.
Reason for omission: There is no known portable test method for this assertion
METH: Call library function testfunc() to do the following:
METH: Open a connection to the X server using native byte sex.
METH: Send an invalid GetInputFocus protocol request to the X server with length
METH: one greater than the maximum length accepted by the server.
METH: Verify that the X server sends back a BadLength error.
METH: Open a connection to the X server using reversed byte sex.
METH: Send an invalid GetInputFocus protocol request to the X server with length
METH: one greater than the maximum length accepted by the server.
METH: Verify that the X server sends back a BadLength error.
TRACE: About to test with Native byte-sex (MSB)
INFO: Processing a big request
child process was terminated by signal 13 (SIGPIPE)
CHECK: GetInputFocus-3 1, line 327
/tset/Xproto/gtmtnevnts/Test 3 	Unresolved 	
Messages from the test

VSW5TESTSUITE PURPOSE 3
Assertion GetMotionEvents-3.(B)
When a client sends an invalid GetMotionEvents protocol
request to the X server, in which the length field of the
request exceeds the maximum length accepted by the X server,
then the X server sends back a BadLength error to the
client.
Reason for omission: There is no known portable test method for this assertion
METH: Call library function testfunc() to do the following:
METH: Open a connection to the X server using native byte sex.
METH: Send an invalid GetMotionEvents protocol request to the X server with length
METH: one greater than the maximum length accepted by the server.
METH: Verify that the X server sends back a BadLength error.
METH: Open a connection to the X server using reversed byte sex.
METH: Send an invalid GetMotionEvents protocol request to the X server with length
METH: one greater than the maximum length accepted by the server.
METH: Verify that the X server sends back a BadLength error.
TRACE: About to test with Native byte-sex (MSB)
TRACE: client 0 sent default CreateWindow for window 4194304
INFO: Processing a big request
child process was terminated by signal 13 (SIGPIPE)
CHECK: GetMotionEvents-3 1, line 327
/tset/Xproto/gtpntrmppn/Test 3 	Unresolved 	
Messages from the test

VSW5TESTSUITE PURPOSE 3
Assertion GetPointerMapping-3.(B)
When a client sends an invalid GetPointerMapping protocol
request to the X server, in which the length field of the
request exceeds the maximum length accepted by the X server,
then the X server sends back a BadLength error to the
client.
Reason for omission: There is no known portable test method for this assertion
METH: Call library function testfunc() to do the following:
METH: Open a connection to the X server using native byte sex.
METH: Send an invalid GetPointerMapping protocol request to the X server with length
METH: one greater than the maximum length accepted by the server.
METH: Verify that the X server sends back a BadLength error.
METH: Open a connection to the X server using reversed byte sex.
METH: Send an invalid GetPointerMapping protocol request to the X server with length
METH: one greater than the maximum length accepted by the server.
METH: Verify that the X server sends back a BadLength error.
TRACE: About to test with Native byte-sex (MSB)
INFO: Processing a big request
child process was terminated by signal 13 (SIGPIPE)
CHECK: GetPointerMapping-3 1, line 327
/tset/Xproto/gtwdwattrb/Test 3 	Unresolved 	
Messages from the test

VSW5TESTSUITE PURPOSE 3
Assertion GetWindowAttributes-3.(B)
When a client sends an invalid GetWindowAttributes protocol
request to the X server, in which the length field of the
request exceeds the maximum length accepted by the X server,
then the X server sends back a BadLength error to the
client.
Reason for omission: There is no known portable test method for this assertion
METH: Call library function testfunc() to do the following:
METH: Open a connection to the X server using native byte sex.
METH: Send an invalid GetWindowAttributes protocol request to the X server with length
METH: one greater than the maximum length accepted by the server.
METH: Verify that the X server sends back a BadLength error.
METH: Open a connection to the X server using reversed byte sex.
METH: Send an invalid GetWindowAttributes protocol request to the X server with length
METH: one greater than the maximum length accepted by the server.
METH: Verify that the X server sends back a BadLength error.
TRACE: About to test with Native byte-sex (MSB)
TRACE: client 0 sent default CreateWindow for window 4194304
INFO: Processing a big request
child process was terminated by signal 13 (SIGPIPE)
CHECK: GetWindowAttributes-3 1, line 327
/tset/Xproto/instllclrm/Test 3 	Unresolved 	
Messages from the test

VSW5TESTSUITE PURPOSE 3
Assertion InstallColormap-3.(B)
When a client sends an invalid InstallColormap protocol
request to the X server, in which the length field of the
request exceeds the maximum length accepted by the X server,
then the X server sends back a BadLength error to the
client.
Reason for omission: There is no known portable test method for this assertion
METH: Call library function testfunc() to do the following:
METH: Open a connection to the X server using native byte sex.
METH: Send an invalid InstallColormap protocol request to the X server with length
METH: one greater than the maximum length accepted by the server.
METH: Verify that the X server sends back a BadLength error.
METH: Open a connection to the X server using reversed byte sex.
METH: Send an invalid InstallColormap protocol request to the X server with length
METH: one greater than the maximum length accepted by the server.
METH: Verify that the X server sends back a BadLength error.
TRACE: About to test with Native byte-sex (MSB)
TRACE: client 0 sent default CreateWindow for window 4194304
TRACE: client 0 sent CreateColormap for colormap 4194305
INFO: Processing a big request
child process was terminated by signal 13 (SIGPIPE)
CHECK: InstallColormap-3 1, line 327
/tset/Xproto/kllclnt/Test 3 	Unresolved 	
Messages from the test

VSW5TESTSUITE PURPOSE 3
Assertion KillClient-3.(B)
When a client sends an invalid KillClient protocol request
to the X server, in which the length field of the request
exceeds the maximum length accepted by the X server, then
the X server sends back a BadLength error to the client.
Reason for omission: There is no known portable test method for this assertion
METH: Call library function testfunc() to do the following:
METH: Open a connection to the X server using native byte sex.
METH: Send an invalid KillClient protocol request to the X server with length
METH: one greater than the maximum length accepted by the server.
METH: Verify that the X server sends back a BadLength error.
METH: Open a connection to the X server using reversed byte sex.
METH: Send an invalid KillClient protocol request to the X server with length
METH: one greater than the maximum length accepted by the server.
METH: Verify that the X server sends back a BadLength error.
TRACE: About to test with Native byte-sex (MSB)
TRACE: client 0 sent default CreateWindow for window 4194304
TRACE: client 0 sent default CreateGC request
INFO: Processing a big request
child process was terminated by signal 13 (SIGPIPE)
CHECK: KillClient-3 1, line 327
/tset/Xproto/lstextnsns/Test 3 	Unresolved 	
Messages from the test

VSW5TESTSUITE PURPOSE 3
Assertion ListExtensions-3.(B)
When a client sends an invalid ListExtensions protocol
request to the X server, in which the length field of the
request exceeds the maximum length accepted by the X server,
then the X server sends back a BadLength error to the
client.
Reason for omission: There is no known portable test method for this assertion
METH: Call library function testfunc() to do the following:
METH: Open a connection to the X server using native byte sex.
METH: Send an invalid ListExtensions protocol request to the X server with length
METH: one greater than the maximum length accepted by the server.
METH: Verify that the X server sends back a BadLength error.
METH: Open a connection to the X server using reversed byte sex.
METH: Send an invalid ListExtensions protocol request to the X server with length
METH: one greater than the maximum length accepted by the server.
METH: Verify that the X server sends back a BadLength error.
TRACE: About to test with Native byte-sex (MSB)
INFO: Processing a big request
child process was terminated by signal 13 (SIGPIPE)
CHECK: ListExtensions-3 1, line 327
/tset/Xproto/lstfntswth/Test 3 	Unresolved 	
Messages from the test

VSW5TESTSUITE PURPOSE 3
Assertion ListFontsWithInfo-3.(B)
When a client sends an invalid ListFontsWithInfo protocol
request to the X server, in which the length field of the
request exceeds the maximum length accepted by the X server,
then the X server sends back a BadLength error to the
client.
Reason for omission: There is no known portable test method for this assertion
METH: Call library function testfunc() to do the following:
METH: Open a connection to the X server using native byte sex.
METH: Send an invalid ListFontsWithInfo protocol request to the X server with length
METH: one greater than the maximum length accepted by the server.
METH: Verify that the X server sends back a BadLength error.
METH: Open a connection to the X server using reversed byte sex.
METH: Send an invalid ListFontsWithInfo protocol request to the X server with length
METH: one greater than the maximum length accepted by the server.
METH: Verify that the X server sends back a BadLength error.
TRACE: About to test with Native byte-sex (MSB)
INFO: Processing a big request
child process was terminated by signal 13 (SIGPIPE)
CHECK: ListFontsWithInfo-3 1, line 327
/tset/Xproto/lstinstlld/Test 3 	Unresolved 	
Messages from the test

VSW5TESTSUITE PURPOSE 3
Assertion ListInstalledColormaps-3.(B)
When a client sends an invalid ListInstalledColormaps
protocol request to the X server, in which the length field
of the request exceeds the maximum length accepted by the X
server, then the X server sends back a BadLength error to
the client.
Reason for omission: There is no known portable test method for this assertion
METH: Call library function testfunc() to do the following:
METH: Open a connection to the X server using native byte sex.
METH: Send an invalid ListInstalledColormaps protocol request to the X server with length
METH: one greater than the maximum length accepted by the server.
METH: Verify that the X server sends back a BadLength error.
METH: Open a connection to the X server using reversed byte sex.
METH: Send an invalid ListInstalledColormaps protocol request to the X server with length
METH: one greater than the maximum length accepted by the server.
METH: Verify that the X server sends back a BadLength error.
TRACE: About to test with Native byte-sex (MSB)
TRACE: client 0 sent default CreateWindow for window 4194304
INFO: Processing a big request
child process was terminated by signal 13 (SIGPIPE)
CHECK: ListInstalledColormaps-3 1, line 327
/tset/Xproto/mpsbws/Test 3 	Unresolved 	
Messages from the test

VSW5TESTSUITE PURPOSE 3
Assertion MapSubwindows-3.(B)
When a client sends an invalid MapSubwindows protocol
request to the X server, in which the length field of the
request exceeds the maximum length accepted by the X server,
then the X server sends back a BadLength error to the
client.
Reason for omission: There is no known portable test method for this assertion
METH: Call library function testfunc() to do the following:
METH: Open a connection to the X server using native byte sex.
METH: Send an invalid MapSubwindows protocol request to the X server with length
METH: one greater than the maximum length accepted by the server.
METH: Verify that the X server sends back a BadLength error.
METH: Open a connection to the X server using reversed byte sex.
METH: Send an invalid MapSubwindows protocol request to the X server with length
METH: one greater than the maximum length accepted by the server.
METH: Verify that the X server sends back a BadLength error.
TRACE: About to test with Native byte-sex (MSB)
TRACE: client 0 sent default CreateWindow for window 4194304
TRACE: client 0 sent additional CreateWindow request
INFO: Processing a big request
child process was terminated by signal 13 (SIGPIPE)
CHECK: MapSubwindows-3 1, line 327
/tset/Xproto/noprtn/Test 4 	Unresolved 	
Messages from the test

VSW5TESTSUITE PURPOSE 4
Assertion NoOperation-4.(B)
When a client sends an invalid NoOperation protocol request
to the X server, in which the length field of the request
exceeds the maximum length accepted by the X server, then
the X server sends back a BadLength error to the client.
Reason for omission: There is no known portable test method for this assertion
METH: Call library function testfunc() to do the following:
METH: Open a connection to the X server using native byte sex.
METH: Send an invalid NoOperation protocol request to the X server with length
METH: one greater than the maximum length accepted by the server.
METH: Verify that the X server sends back a BadLength error.
METH: Open a connection to the X server using reversed byte sex.
METH: Send an invalid NoOperation protocol request to the X server with length
METH: one greater than the maximum length accepted by the server.
METH: Verify that the X server sends back a BadLength error.
TRACE: About to test with Native byte-sex (MSB)
INFO: Processing a big request
child process was terminated by signal 13 (SIGPIPE)
CHECK: NoOperation-4 1, line 327
/tset/Xproto/plyarc/Test 3 	Unresolved 	
Messages from the test

VSW5TESTSUITE PURPOSE 3
Assertion PolyArc-3.(B)
When a client sends an invalid PolyArc protocol request to
the X server, in which the length field of the request
exceeds the maximum length accepted by the X server, then
the X server sends back a BadLength error to the client.
Reason for omission: There is no known portable test method for this assertion
METH: Call library function testfunc() to do the following:
METH: Open a connection to the X server using native byte sex.
METH: Send an invalid PolyArc protocol request to the X server with length
METH: greater than that accepted by the X server.
METH: Verify that the X server sends back a BadLength error.
METH: Open a connection to the X server using reversed byte sex.
METH: Send an invalid PolyArc protocol request to the X server with length
METH: greater than that accepted by the X server.
METH: Verify that the X server sends back a BadLength error.
TRACE: About to test with Native byte-sex (MSB)
TRACE: client 0 sent default CreateWindow for window 4194304
TRACE: client 0 sent default CreateGC request
TRACE: sent default MapWindow
TRACE: received an Expose event
INFO: Processing a big request
child process was terminated by signal 13 (SIGPIPE)
CHECK: PolyArc-3 1, line 327
/tset/Xproto/plyfllrctn/Test 3 	Unresolved 	
Messages from the test

VSW5TESTSUITE PURPOSE 3
Assertion PolyFillRectangle-3.(B)
When a client sends an invalid PolyFillRectangle protocol
request to the X server, in which the length field of the
request exceeds the maximum length accepted by the X server,
then the X server sends back a BadLength error to the
client.
Reason for omission: There is no known portable test method for this assertion
METH: Call library function testfunc() to do the following:
METH: Open a connection to the X server using native byte sex.
METH: Send an invalid PolyFillRectangle protocol request to the X server with length
METH: one greater than the maximum length accepted by the server.
METH: Verify that the X server sends back a BadLength error.
METH: Open a connection to the X server using reversed byte sex.
METH: Send an invalid PolyFillRectangle protocol request to the X server with length
METH: one greater than the maximum length accepted by the server.
METH: Verify that the X server sends back a BadLength error.
TRACE: About to test with Native byte-sex (MSB)
TRACE: client 0 sent default CreateWindow for window 4194304
TRACE: client 0 sent default CreateGC request
TRACE: sent default MapWindow
TRACE: received an Expose event
INFO: Processing a big request
child process was terminated by signal 13 (SIGPIPE)
CHECK: PolyFillRectangle-3 1, line 327
/tset/Xproto/plyln/Test 3 	Unresolved 	
Messages from the test

VSW5TESTSUITE PURPOSE 3
Assertion PolyLine-3.(B)
When a client sends an invalid PolyLine protocol request to
the X server, in which the length field of the request
exceeds the maximum length accepted by the X server, then
the X server sends back a BadLength error to the client.
Reason for omission: There is no known portable test method for this assertion
METH: Call library function testfunc() to do the following:
METH: Open a connection to the X server using native byte sex.
METH: Send an invalid PolyLine protocol request to the X server with length
METH: one greater than the maximum length accepted by the server.
METH: Verify that the X server sends back a BadLength error.
METH: Open a connection to the X server using reversed byte sex.
METH: Send an invalid PolyLine protocol request to the X server with length
METH: one greater than the maximum length accepted by the server.
METH: Verify that the X server sends back a BadLength error.
TRACE: About to test with Native byte-sex (MSB)
TRACE: client 0 sent default CreateWindow for window 4194304
TRACE: client 0 sent default CreateGC request
TRACE: sent default MapWindow
TRACE: received an Expose event
INFO: Processing a big request
child process was terminated by signal 13 (SIGPIPE)
CHECK: PolyLine-3 1, line 327
/tset/Xproto/plyrctngl/Test 3 	Unresolved 	
Messages from the test

VSW5TESTSUITE PURPOSE 3
Assertion PolyRectangle-3.(B)
When a client sends an invalid PolyRectangle protocol
request to the X server, in which the length field of the
request exceeds the maximum length accepted by the X server,
then the X server sends back a BadLength error to the
client.
Reason for omission: There is no known portable test method for this assertion
METH: Call library function testfunc() to do the following:
METH: Open a connection to the X server using native byte sex.
METH: Send an invalid PolyRectangle protocol request to the X server with length
METH: one greater than the maximum length accepted by the server.
METH: Verify that the X server sends back a BadLength error.
METH: Open a connection to the X server using reversed byte sex.
METH: Send an invalid PolyRectangle protocol request to the X server with length
METH: one greater than the maximum length accepted by the server.
METH: Verify that the X server sends back a BadLength error.
TRACE: About to test with Native byte-sex (MSB)
TRACE: client 0 sent default CreateWindow for window 4194304
TRACE: client 0 sent default CreateGC request
TRACE: sent default MapWindow
TRACE: received an Expose event
INFO: Processing a big request
child process was terminated by signal 13 (SIGPIPE)
CHECK: PolyRectangle-3 1, line 327
/tset/Xproto/plysgmnt/Test 3 	Unresolved 	
Messages from the test

VSW5TESTSUITE PURPOSE 3
Assertion PolySegment-3.(B)
When a client sends an invalid PolySegment protocol request
to the X server, in which the length field of the request
exceeds the maximum length accepted by the X server, then
the X server sends back a BadLength error to the client.
Reason for omission: There is no known portable test method for this assertion
METH: Call library function testfunc() to do the following:
METH: Open a connection to the X server using native byte sex.
METH: Send an invalid PolySegment protocol request to the X server with length
METH: greater than that accepted by the X server.
METH: Verify that the X server sends back a BadLength error.
METH: Open a connection to the X server using reversed byte sex.
METH: Send an invalid PolySegment protocol request to the X server with length
METH: greater than that accepted by the X server.
METH: Verify that the X server sends back a BadLength error.
TRACE: About to test with Native byte-sex (MSB)
TRACE: client 0 sent default CreateWindow for window 4194304
TRACE: client 0 sent default CreateGC request
TRACE: sent default MapWindow
TRACE: received an Expose event
INFO: Processing a big request
child process was terminated by signal 13 (SIGPIPE)
CHECK: PolySegment-3 1, line 327
/tset/Xproto/plytxt8/Test 3 	Unresolved 	
Messages from the test

VSW5TESTSUITE PURPOSE 3
Assertion PolyText8-3.(B)
When a client sends an invalid PolyText8 protocol request
to the X server, in which the length field of the request
exceeds the maximum length accepted by the X server, then
the X server sends back a BadLength error to the client.
Reason for omission: There is no known portable test method for this assertion
METH: Call library function testfunc() to do the following:
METH: Open a connection to the X server using native byte sex.
METH: Send an invalid PolyText8 protocol request to the X server with length
METH: one greater than the maximum length accepted by the server.
METH: Verify that the X server sends back a BadLength error.
METH: Open a connection to the X server using reversed byte sex.
METH: Send an invalid PolyText8 protocol request to the X server with length
METH: one greater than the maximum length accepted by the server.
METH: Verify that the X server sends back a BadLength error.
TRACE: About to test with Native byte-sex (MSB)
TRACE: client 0 sent default CreateWindow for window 4194304
TRACE: client 0 sent default CreateGC request
TRACE: sent default MapWindow
TRACE: received an Expose event
TRACE: Request was:
INFO: Processing a big request
child process was terminated by signal 13 (SIGPIPE)
CHECK: PolyText8-3 1, line 327
/tset/Xproto/qryclrs/Test 3 	Unresolved 	
Messages from the test

VSW5TESTSUITE PURPOSE 3
Assertion QueryColors-3.(B)
When a client sends an invalid QueryColors protocol request
to the X server, in which the length field of the request
exceeds the maximum length accepted by the X server, then
the X server sends back a BadLength error to the client.
Reason for omission: There is no known portable test method for this assertion
METH: Call library function testfunc() to do the following:
METH: Open a connection to the X server using native byte sex.
METH: Send an invalid QueryColors protocol request to the X server with length
METH: one greater than the maximum length accepted by the server.
METH: Verify that the X server sends back a BadLength error.
METH: Open a connection to the X server using reversed byte sex.
METH: Send an invalid QueryColors protocol request to the X server with length
METH: one greater than the maximum length accepted by the server.
METH: Verify that the X server sends back a BadLength error.
TRACE: About to test with Native byte-sex (MSB)
TRACE: client 0 sent default CreateWindow for window 4194304
TRACE: client 0 sent CreateColormap for colormap 4194305
TRACE: client 0 sent default AllocNamedColor request
TRACE: client 0 received AllocNamedColor reply
INFO: Processing a big request
child process was terminated by signal 13 (SIGPIPE)
CHECK: QueryColors-3 1, line 327
/tset/Xproto/qryfnt/Test 3 	Unresolved 	
Messages from the test

VSW5TESTSUITE PURPOSE 3
Assertion QueryFont-3.(B)
When a client sends an invalid QueryFont protocol request
to the X server, in which the length field of the request
exceeds the maximum length accepted by the X server, then
the X server sends back a BadLength error to the client.
Reason for omission: There is no known portable test method for this assertion
METH: Call library function testfunc() to do the following:
METH: Open a connection to the X server using native byte sex.
METH: Send an invalid QueryFont protocol request to the X server with length
METH: one greater than the maximum length accepted by the server.
METH: Verify that the X server sends back a BadLength error.
METH: Open a connection to the X server using reversed byte sex.
METH: Send an invalid QueryFont protocol request to the X server with length
METH: one greater than the maximum length accepted by the server.
METH: Verify that the X server sends back a BadLength error.
TRACE: client 7 sent startup GetFontPath request
TRACE: client 7 received startup GetFontPath reply
TRACE: Server's initial fontpath was '/opt/lsb/test/lsb-xts5/xts5/fonts,/opt/lsb/share/fonts/misc'
TRACE: client 7 sent startup SetFontPath request
TRACE: About to test with Native byte-sex (MSB)
TRACE: client 0 sent default OpenFont request
INFO: Processing a big request
child process was terminated by signal 13 (SIGPIPE)
CHECK: QueryFont-3 1, line 327
TRACE: client 7 sent startup SetFontPath request
/tset/Xproto/qrykymp/Test 3 	Unresolved 	
Messages from the test

VSW5TESTSUITE PURPOSE 3
Assertion QueryKeymap-3.(B)
When a client sends an invalid QueryKeymap protocol request
to the X server, in which the length field of the request
exceeds the maximum length accepted by the X server, then
the X server sends back a BadLength error to the client.
Reason for omission: There is no known portable test method for this assertion
METH: Call library function testfunc() to do the following:
METH: Open a connection to the X server using native byte sex.
METH: Send an invalid QueryKeymap protocol request to the X server with length
METH: one greater than the maximum length accepted by the server.
METH: Verify that the X server sends back a BadLength error.
METH: Open a connection to the X server using reversed byte sex.
METH: Send an invalid QueryKeymap protocol request to the X server with length
METH: one greater than the maximum length accepted by the server.
METH: Verify that the X server sends back a BadLength error.
TRACE: About to test with Native byte-sex (MSB)
INFO: Processing a big request
child process was terminated by signal 13 (SIGPIPE)
CHECK: QueryKeymap-3 1, line 327
/tset/Xproto/qrytxtextn/Test 3 	Unresolved 	
Messages from the test

VSW5TESTSUITE PURPOSE 3
Assertion QueryTextExtents-3.(B)
When a client sends an invalid QueryTextExtents protocol
request to the X server, in which the length field of the
request exceeds the maximum length accepted by the X server,
then the X server sends back a BadLength error to the
client.
Reason for omission: There is no known portable test method for this assertion
METH: Call library function testfunc() to do the following:
METH: Open a connection to the X server using native byte sex.
METH: Send an invalid QueryTextExtents protocol request to the X server with length
METH: one greater than the maximum length accepted by the server.
METH: Verify that the X server sends back a BadLength error.
METH: Open a connection to the X server using reversed byte sex.
METH: Send an invalid QueryTextExtents protocol request to the X server with length
METH: one greater than the maximum length accepted by the server.
METH: Verify that the X server sends back a BadLength error.
TRACE: client 7 sent startup GetFontPath request
TRACE: client 7 received startup GetFontPath reply
TRACE: Server's initial fontpath was '/opt/lsb/test/lsb-xts5/xts5/fonts,/opt/lsb/share/fonts/misc'
TRACE: client 7 sent startup SetFontPath request
TRACE: About to test with Native byte-sex (MSB)
TRACE: client 0 sent default OpenFont request
INFO: Processing a big request
child process was terminated by signal 13 (SIGPIPE)
CHECK: QueryTextExtents-3 1, line 327
TRACE: client 7 sent startup SetFontPath request
/tset/Xproto/rttprprts/Test 3 	Unresolved 	
Messages from the test

VSW5TESTSUITE PURPOSE 3
Assertion RotateProperties-3.(B)
When a client sends an invalid RotateProperties protocol
request to the X server, in which the length field of the
request exceeds the maximum length accepted by the X server,
then the X server sends back a BadLength error to the
client.
Reason for omission: There is no known portable test method for this assertion
METH: Call library function testfunc() to do the following:
METH: Open a connection to the X server using native byte sex.
METH: Send an invalid RotateProperties protocol request to the X server with length
METH: one greater than the maximum length accepted by the server.
METH: Verify that the X server sends back a BadLength error.
METH: Open a connection to the X server using reversed byte sex.
METH: Send an invalid RotateProperties protocol request to the X server with length
METH: one greater than the maximum length accepted by the server.
METH: Verify that the X server sends back a BadLength error.
TRACE: About to test with Native byte-sex (MSB)
TRACE: client 0 sent default CreateWindow for window 4194304
TRACE: client 0 sent default InternAtom request
TRACE: client 0 received InternAtom reply
TRACE: client 0 sent default InternAtom request
TRACE: client 0 received InternAtom reply
TRACE: Test_Atom1 is 0x8a
TRACE: Test_Atom2 is 0x8b
INFO: Processing a big request
child process was terminated by signal 13 (SIGPIPE)
CHECK: RotateProperties-3 1, line 327
/tset/Xproto/stclprctng/Test 3 	Unresolved 	
Messages from the test

VSW5TESTSUITE PURPOSE 3
Assertion SetClipRectangles-3.(B)
When a client sends an invalid SetClipRectangles protocol
request to the X server, in which the length field of the
request exceeds the maximum length accepted by the X server,
then the X server sends back a BadLength error to the
client.
Reason for omission: There is no known portable test method for this assertion
METH: Call library function testfunc() to do the following:
METH: Open a connection to the X server using native byte sex.
METH: Send an invalid SetClipRectangles protocol request to the X server with length
METH: one greater than the maximum length accepted by the server.
METH: Verify that the X server sends back a BadLength error.
METH: Open a connection to the X server using reversed byte sex.
METH: Send an invalid SetClipRectangles protocol request to the X server with length
METH: one greater than the maximum length accepted by the server.
METH: Verify that the X server sends back a BadLength error.
TRACE: About to test with Native byte-sex (MSB)
TRACE: client 0 sent default CreateWindow for window 4194304
TRACE: client 0 sent default CreateGC request
INFO: Processing a big request
child process was terminated by signal 13 (SIGPIPE)
CHECK: SetClipRectangles-3 1, line 327
/tset/Xproto/stdshs/Test 3 	Unresolved 	
Messages from the test

VSW5TESTSUITE PURPOSE 3
Assertion SetDashes-3.(B)
When a client sends an invalid SetDashes protocol request
to the X server, in which the length field of the request
exceeds the maximum length accepted by the X server, then
the X server sends back a BadLength error to the client.
Reason for omission: There is no known portable test method for this assertion
METH: Call library function testfunc() to do the following:
METH: Open a connection to the X server using native byte sex.
METH: Send an invalid SetDashes protocol request to the X server with length
METH: one greater than the maximum length accepted by the server.
METH: Verify that the X server sends back a BadLength error.
METH: Open a connection to the X server using reversed byte sex.
METH: Send an invalid SetDashes protocol request to the X server with length
METH: one greater than the maximum length accepted by the server.
METH: Verify that the X server sends back a BadLength error.
TRACE: About to test with Native byte-sex (MSB)
TRACE: client 0 sent default CreateWindow for window 4194304
TRACE: client 0 sent default CreateGC request
INFO: Processing a big request
child process was terminated by signal 13 (SIGPIPE)
CHECK: SetDashes-3 1, line 327
/tset/Xproto/stfntpth/Test 3 	Unresolved 	
Messages from the test

VSW5TESTSUITE PURPOSE 3
Assertion SetFontPath-3.(B)
When a client sends an invalid SetFontPath protocol request
to the X server, in which the length field of the request
exceeds the maximum length accepted by the X server, then
the X server sends back a BadLength error to the client.
Reason for omission: There is no known portable test method for this assertion
METH: Call library function testfunc() to do the following:
METH: Open a connection to the X server using native byte sex.
METH: Send an invalid SetFontPath protocol request to the X server with length
METH: one greater than the maximum length accepted by the server.
METH: Verify that the X server sends back a BadLength error.
METH: Open a connection to the X server using reversed byte sex.
METH: Send an invalid SetFontPath protocol request to the X server with length
METH: one greater than the maximum length accepted by the server.
METH: Verify that the X server sends back a BadLength error.
TRACE: About to test with Native byte-sex (MSB)
INFO: Processing a big request
child process was terminated by signal 13 (SIGPIPE)
CHECK: SetFontPath-3 1, line 327
/tset/Xproto/stpntrmppn/Test 3 	Unresolved 	
Messages from the test

VSW5TESTSUITE PURPOSE 3
Assertion SetPointerMapping-3.(B)
When a client sends an invalid SetPointerMapping protocol
request to the X server, in which the length field of the
request exceeds the maximum length accepted by the X server,
then the X server sends back a BadLength error to the
client.
Reason for omission: There is no known portable test method for this assertion
METH: Call library function testfunc() to do the following:
METH: Open a connection to the X server using native byte sex.
METH: Send an invalid SetPointerMapping protocol request to the X server with length
METH: one greater than the maximum length accepted by the server.
METH: Verify that the X server sends back a BadLength error.
METH: Open a connection to the X server using reversed byte sex.
METH: Send an invalid SetPointerMapping protocol request to the X server with length
METH: one greater than the maximum length accepted by the server.
METH: Verify that the X server sends back a BadLength error.
TRACE: About to test with Native byte-sex (MSB)
TRACE: client 0 sent default GetPointerMapping request
TRACE: client 0 received GetPointerMapping reply
INFO: Processing a big request
child process was terminated by signal 13 (SIGPIPE)
CHECK: SetPointerMapping-3 1, line 327
/tset/Xproto/strclrs/Test 4 	Unresolved 	
Messages from the test

VSW5TESTSUITE PURPOSE 4
Assertion StoreColors-4.(B)
When a client sends an invalid StoreColors protocol request
to the X server, in which the length field of the request
exceeds the maximum length accepted by the X server, then
the X server sends back a BadLength error to the client.
Reason for omission: There is no known portable test method for this assertion
METH: Call library function testfunc() to do the following:
METH: Open a connection to the X server using native byte sex.
METH: Send an invalid StoreColors protocol request to the X server with length
METH: one greater than the maximum length accepted by the server.
METH: Verify that the X server sends back a BadLength error.
METH: Open a connection to the X server using reversed byte sex.
METH: Send an invalid StoreColors protocol request to the X server with length
METH: one greater than the maximum length accepted by the server.
METH: Verify that the X server sends back a BadLength error.
TRACE: About to test with Native byte-sex (MSB)
TRACE: client 0 sent default CreateWindow for window 4194304
TRACE: client 0 sent CreateColormap for colormap 4194305
TRACE: client 0 sent default AllocNamedColor request
TRACE: client 0 received AllocNamedColor reply
INFO: Processing a big request
child process was terminated by signal 13 (SIGPIPE)
CHECK: StoreColors-4 1, line 327
/tset/Xproto/ungrbbttn/Test 3 	Unresolved 	
Messages from the test

VSW5TESTSUITE PURPOSE 3
Assertion UngrabButton-3.(B)
When a client sends an invalid UngrabButton protocol
request to the X server, in which the length field of the
request exceeds the maximum length accepted by the X server,
then the X server sends back a BadLength error to the
client.
Reason for omission: There is no known portable test method for this assertion
METH: Call library function testfunc() to do the following:
METH: Open a connection to the X server using native byte sex.
METH: Send an invalid UngrabButton protocol request to the X server with length
METH: one greater than the maximum length accepted by the server.
METH: Verify that the X server sends back a BadLength error.
METH: Open a connection to the X server using reversed byte sex.
METH: Send an invalid UngrabButton protocol request to the X server with length
METH: one greater than the maximum length accepted by the server.
METH: Verify that the X server sends back a BadLength error.
TRACE: About to test with Native byte-sex (MSB)
TRACE: client 0 sent default CreateWindow for window 4194304
TRACE: client 0 sent default GrabButton request
INFO: Processing a big request
child process was terminated by signal 13 (SIGPIPE)
CHECK: UngrabButton-3 1, line 327
/tset/Xproto/ungrbky/Test 3 	Unresolved 	
Messages from the test

VSW5TESTSUITE PURPOSE 3
Assertion UngrabKey-3.(B)
When a client sends an invalid UngrabKey protocol request
to the X server, in which the length field of the request
exceeds the maximum length accepted by the X server, then
the X server sends back a BadLength error to the client.
Reason for omission: There is no known portable test method for this assertion
METH: Call library function testfunc() to do the following:
METH: Open a connection to the X server using native byte sex.
METH: Send an invalid UngrabKey protocol request to the X server with length
METH: one greater than the maximum length accepted by the server.
METH: Verify that the X server sends back a BadLength error.
METH: Open a connection to the X server using reversed byte sex.
METH: Send an invalid UngrabKey protocol request to the X server with length
METH: one greater than the maximum length accepted by the server.
METH: Verify that the X server sends back a BadLength error.
TRACE: About to test with Native byte-sex (MSB)
TRACE: client 0 sent default CreateWindow for window 4194304
TRACE: client 0 sent default GrabKey request
INFO: Processing a big request
child process was terminated by signal 13 (SIGPIPE)
CHECK: UngrabKey-3 1, line 327
/tset/Xproto/ungrbsrvr/Test 3 	Unresolved 	
Messages from the test

VSW5TESTSUITE PURPOSE 3
Assertion UngrabServer-3.(B)
When a client sends an invalid UngrabServer protocol
request to the X server, in which the length field of the
request exceeds the maximum length accepted by the X server,
then the X server sends back a BadLength error to the
client.
Reason for omission: There is no known portable test method for this assertion
METH: Call library function testfunc() to do the following:
METH: Open a connection to the X server using native byte sex.
METH: Send an invalid UngrabServer protocol request to the X server with length
METH: one greater than the maximum length accepted by the server.
METH: Verify that the X server sends back a BadLength error.
METH: Open a connection to the X server using reversed byte sex.
METH: Send an invalid UngrabServer protocol request to the X server with length
METH: one greater than the maximum length accepted by the server.
METH: Verify that the X server sends back a BadLength error.
TRACE: About to test with Native byte-sex (MSB)
TRACE: client 0 sent default CreateWindow for window 4194304
TRACE: client 0 sent default GrabServer
INFO: Processing a big request
child process was terminated by signal 13 (SIGPIPE)
CHECK: UngrabServer-3 1, line 327
/tset/Xproto/unnstllclr/Test 3 	Unresolved 	
Messages from the test

VSW5TESTSUITE PURPOSE 3
Assertion UninstallColormap-3.(B)
When a client sends an invalid UninstallColormap protocol
request to the X server, in which the length field of the
request exceeds the maximum length accepted by the X server,
then the X server sends back a BadLength error to the
client.
Reason for omission: There is no known portable test method for this assertion
METH: Call library function testfunc() to do the following:
METH: Open a connection to the X server using native byte sex.
METH: Send an invalid UninstallColormap protocol request to the X server with length
METH: one greater than the maximum length accepted by the server.
METH: Verify that the X server sends back a BadLength error.
METH: Open a connection to the X server using reversed byte sex.
METH: Send an invalid UninstallColormap protocol request to the X server with length
METH: one greater than the maximum length accepted by the server.
METH: Verify that the X server sends back a BadLength error.
TRACE: About to test with Native byte-sex (MSB)
TRACE: client 0 sent default CreateWindow for window 4194304
TRACE: client 0 sent CreateColormap for colormap 4194305
TRACE: client 0 sent default InstallColormap request
INFO: Processing a big request
child process was terminated by signal 13 (SIGPIPE)
CHECK: UninstallColormap-3 1, line 327
/tset/Xproto/wrppntr/Test 3 	Unresolved 	
Messages from the test

VSW5TESTSUITE PURPOSE 3
Assertion WarpPointer-3.(B)
When a client sends an invalid WarpPointer protocol request
to the X server, in which the length field of the request
exceeds the maximum length accepted by the X server, then
the X server sends back a BadLength error to the client.
Reason for omission: There is no known portable test method for this assertion
METH: Call library function testfunc() to do the following:
METH: Open a connection to the X server using native byte sex.
METH: Send an invalid WarpPointer protocol request to the X server with length
METH: one greater than the maximum length accepted by the server.
METH: Verify that the X server sends back a BadLength error.
METH: Open a connection to the X server using reversed byte sex.
METH: Send an invalid WarpPointer protocol request to the X server with length
METH: one greater than the maximum length accepted by the server.
METH: Verify that the X server sends back a BadLength error.
TRACE: About to test with Native byte-sex (MSB)
INFO: Processing a big request
child process was terminated by signal 13 (SIGPIPE)
CHECK: WarpPointer-3 1, line 327
/tset/Xlib3/vndrrls/Test 1 	FIP  [?] 	
Messages from the test

VSW5TESTSUITE PURPOSE 1
Assertion XVendorRelease-1.(B)
A call to XVendorRelease returns a number related to a
vendor's release of the X server.
Reason for omission: There is no known portable test method for this assertion
METH: Obtain the value of the vendor's X server release using XVendorRelease.
REPORT: XVendorRelease() returned 70200000 instead of 40201001.
/tset/Xlib3/srvrvndr/Test 1 	FIP (quelled) 	Correct answer for X.Org-based X server
Messages from the test

VSW5TESTSUITE PURPOSE 1
Assertion XServerVendor-1.(A)
A call to XServerVendor returns a pointer to a
null-terminated string that identifies the owner of the X
server implementation.
METH: Obtain the server vendor string using XServerVendor.
METH: Verify that the value is that given in parameter XT_SERVER_VENDOR.
REPORT: XServerVendor() returns incorrect value for server vendor string
REPORT: Expected value "The XFree86 Project, Inc:The X.Org Foundation"
REPORT: Observed value "The X.Org Foundation"
Comment:
This answer is correct provided that the X server is X.Org-based.
/tset/Xlib3/vndrrls/MTest 1 	FIP  [?] 	
Messages from the test

VSW5TESTSUITE PURPOSE 1
Assertion VendorRelease-1.(B)
A call to VendorRelease returns a number related to a
vendor's release of the X server.
Reason for omission: There is no known portable test method for this assertion
METH: Obtain the value of the vendor's X server release using VendorRelease.
REPORT: VendorRelease() returned 70200000 instead of 40201001.
/tset/Xlib3/srvrvndr/MTest 1 	FIP (quelled) 	Correct answer for X.Org-based X server
Messages from the test

VSW5TESTSUITE PURPOSE 1
Assertion ServerVendor-1.(A)
A call to ServerVendor returns a pointer to a
null-terminated string that identifies the owner of the X
server implementation.
METH: Obtain the server vendor string using ServerVendor.
METH: Verify that the value is that given in parameter XT_SERVER_VENDOR.
REPORT: ServerVendor() returns incorrect value for server vendor string
REPORT: Expected value "The XFree86 Project, Inc:The X.Org Foundation"
REPORT: Observed value "The X.Org Foundation"
Comment:
This answer is correct provided that the X server is X.Org-based.
/tset/Xlib9/drwarc/Test 42 	Warning 	
Messages from the test

VSW5TESTSUITE PURPOSE 42
Assertion XDrawArc-42.(A)
When the line_style is LineOnOffDash, then cap_style
applies to all internal ends of the individual dashes,
except CapNotLast is treated as CapButt.
METH: Set graphics coordinates for dashed lines
METH: (includes horizontal and vertical cases,
METH: and includes joins and caps where relevant).
METH: Set the line_style of the GC to LineOnOffDash using XChangeGC.
METH: Set the dash_list of the GC to using XSetDashes.
METH: For cap_style CapNotLast, CapButt, CapProjecting, CapRound:
METH: Set the cap_style of the GC using XChangeGC.
METH: Draw paths.
METH: Pixmap verify.
METH: Clear drawable.
TRACE: --- Running test with visual class TrueColor, depth 16
TRACE: LineOnOffDash with CapNotLast width 4
CHECK: XDrawArc-42 1, line 3626
TRACE: LineOnOffDash with CapButt width 4
CHECK: XDrawArc-42 2, line 3626
TRACE: LineOnOffDash with CapProjecting width 4
CHECK: XDrawArc-42 3, line 3626
TRACE: LineOnOffDash with CapRound width 4
REPORT: A total of 4 out of 9000 pixels were bad
REPORT: Pixel check failed. See file Err0000.err for results
CHECK: XDrawArc-42 4, line 3626
TRACE: LineOnOffDash with CapNotLast width 5
CHECK: XDrawArc-42 5, line 3626
TRACE: LineOnOffDash with CapButt width 5
CHECK: XDrawArc-42 6, line 3626
TRACE: LineOnOffDash with CapProjecting width 5
CHECK: XDrawArc-42 7, line 3626
TRACE: LineOnOffDash with CapRound width 5
CHECK: XDrawArc-42 8, line 3626
TRACE: --- Running test with visual class DirectColor, depth 16
TRACE: LineOnOffDash with CapNotLast width 4
CHECK: XDrawArc-42 9, line 3626
TRACE: LineOnOffDash with CapButt width 4
CHECK: XDrawArc-42 10, line 3626
TRACE: LineOnOffDash with CapProjecting width 4
CHECK: XDrawArc-42 11, line 3626
TRACE: LineOnOffDash with CapRound width 4
REPORT: A total of 4 out of 9000 pixels were bad
REPORT: Pixel check failed. See file Err0001.err for results
CHECK: XDrawArc-42 12, line 3626
TRACE: LineOnOffDash with CapNotLast width 5
CHECK: XDrawArc-42 13, line 3626
TRACE: LineOnOffDash with CapButt width 5
CHECK: XDrawArc-42 14, line 3626
TRACE: LineOnOffDash with CapProjecting width 5
CHECK: XDrawArc-42 15, line 3626
TRACE: LineOnOffDash with CapRound width 5
CHECK: XDrawArc-42 16, line 3626
TRACE: --- Running test with pixmap depth 1
TRACE: LineOnOffDash with CapNotLast width 4
CHECK: XDrawArc-42 17, line 3626
TRACE: LineOnOffDash with CapButt width 4
CHECK: XDrawArc-42 18, line 3626
TRACE: LineOnOffDash with CapProjecting width 4
CHECK: XDrawArc-42 19, line 3626
TRACE: LineOnOffDash with CapRound width 4
REPORT: A total of 4 out of 9000 pixels were bad
REPORT: Pixel check failed. See file Err0002.err for results
CHECK: XDrawArc-42 20, line 3626
TRACE: LineOnOffDash with CapNotLast width 5
CHECK: XDrawArc-42 21, line 3626
TRACE: LineOnOffDash with CapButt width 5
CHECK: XDrawArc-42 22, line 3626
TRACE: LineOnOffDash with CapProjecting width 5
CHECK: XDrawArc-42 23, line 3626
TRACE: LineOnOffDash with CapRound width 5
CHECK: XDrawArc-42 24, line 3626
TRACE: --- Running test with pixmap depth 16
TRACE: LineOnOffDash with CapNotLast width 4
CHECK: XDrawArc-42 25, line 3626
TRACE: LineOnOffDash with CapButt width 4
CHECK: XDrawArc-42 26, line 3626
TRACE: LineOnOffDash with CapProjecting width 4
CHECK: XDrawArc-42 27, line 3626
TRACE: LineOnOffDash with CapRound width 4
REPORT: A total of 4 out of 9000 pixels were bad
REPORT: Pixel check failed. See file Err0003.err for results
CHECK: XDrawArc-42 28, line 3626
TRACE: LineOnOffDash with CapNotLast width 5
CHECK: XDrawArc-42 29, line 3626
TRACE: LineOnOffDash with CapButt width 5
CHECK: XDrawArc-42 30, line 3626
TRACE: LineOnOffDash with CapProjecting width 5
CHECK: XDrawArc-42 31, line 3626
TRACE: LineOnOffDash with CapRound width 5
CHECK: XDrawArc-42 32, line 3626
TRACE: --- Running test with pixmap depth 16
TRACE: LineOnOffDash with CapNotLast width 4
CHECK: XDrawArc-42 33, line 3626
TRACE: LineOnOffDash with CapButt width 4
CHECK: XDrawArc-42 34, line 3626
TRACE: LineOnOffDash with CapProjecting width 4
CHECK: XDrawArc-42 35, line 3626
TRACE: LineOnOffDash with CapRound width 4
REPORT: A total of 4 out of 9000 pixels were bad
REPORT: Pixel check failed. See file Err0004.err for results
CHECK: XDrawArc-42 36, line 3626
TRACE: LineOnOffDash with CapNotLast width 5
CHECK: XDrawArc-42 37, line 3626
TRACE: LineOnOffDash with CapButt width 5
CHECK: XDrawArc-42 38, line 3626
TRACE: LineOnOffDash with CapProjecting width 5
CHECK: XDrawArc-42 39, line 3626
TRACE: LineOnOffDash with CapRound width 5
CHECK: XDrawArc-42 40, line 3626
/tset/Xlib9/drwarc/Test 63 	Warning 	
Messages from the test

VSW5TESTSUITE PURPOSE 63
Assertion XDrawArc-63.(A)
When the cap_style is CapNotLast and the line_width is zero
(0), then this is equivalent to CapButt except that the
final endpoint is not drawn.
METH: Draw line with CapButt.
METH: Set GC component function to GXxor.
METH: Draw line with CapNotLast.
METH: Verify that only the final end point is set.
TRACE: --- Running test with visual class TrueColor, depth 16
REPORT: Pixel mismatch in image
REPORT: See file Err0005.err for details
REPORT: Cap style incorrect for thin line and CapNotLast
CHECK: XDrawArc-63 1, line 4622
TRACE: --- Running test with visual class DirectColor, depth 16
REPORT: Pixel mismatch in image
REPORT: See file Err0006.err for details
REPORT: Cap style incorrect for thin line and CapNotLast
CHECK: XDrawArc-63 2, line 4622
TRACE: --- Running test with pixmap depth 1
REPORT: Pixel mismatch in image
REPORT: See file Err0007.err for details
REPORT: Cap style incorrect for thin line and CapNotLast
CHECK: XDrawArc-63 3, line 4622
TRACE: --- Running test with pixmap depth 16
REPORT: Pixel mismatch in image
REPORT: See file Err0008.err for details
REPORT: Cap style incorrect for thin line and CapNotLast
CHECK: XDrawArc-63 4, line 4622
TRACE: --- Running test with pixmap depth 16
REPORT: Pixel mismatch in image
REPORT: See file Err0009.err for details
REPORT: Cap style incorrect for thin line and CapNotLast
CHECK: XDrawArc-63 5, line 4622
/tset/Xlib9/drwarc/Test 66 	Warning 	
Messages from the test

VSW5TESTSUITE PURPOSE 66
Assertion XDrawArc-66.(A)
When the cap_style is CapRound and line-width is not zero,
then the line has a circular arc, with the diamater equal to
the line_width, centred on the endpoint.
METH: For a variety of line widths.
METH: Draw line with CapRound.
METH: Pixmap verify.
TRACE: --- Running test with visual class TrueColor, depth 16
TRACE: Trying CapRound with width of 1
CHECK: XDrawArc-66 1, line 4750
TRACE: Trying CapRound with width of 2
REPORT: A total of 2 out of 9000 pixels were bad
REPORT: Pixel check failed. See file Err0010.err for results
CHECK: XDrawArc-66 2, line 4750
TRACE: Trying CapRound with width of 4
REPORT: A total of 2 out of 9000 pixels were bad
REPORT: Pixel check failed. See file Err0011.err for results
CHECK: XDrawArc-66 3, line 4750
TRACE: Trying CapRound with width of 5
CHECK: XDrawArc-66 4, line 4750
TRACE: Trying CapRound with width of 10
REPORT: A total of 6 out of 9000 pixels were bad
REPORT: Pixel check failed. See file Err0012.err for results
CHECK: XDrawArc-66 5, line 4750
TRACE: Trying CapRound with width of 11
CHECK: XDrawArc-66 6, line 4750
TRACE: Trying CapRound with width of 40
REPORT: A total of 1 out of 9000 pixels were bad
REPORT: Pixel check failed. See file Err0013.err for results
CHECK: XDrawArc-66 7, line 4750
TRACE: Trying CapRound with width of 41
CHECK: XDrawArc-66 8, line 4750
TRACE: --- Running test with visual class DirectColor, depth 16
TRACE: Trying CapRound with width of 1
CHECK: XDrawArc-66 9, line 4750
TRACE: Trying CapRound with width of 2
REPORT: A total of 2 out of 9000 pixels were bad
REPORT: Pixel check failed. See file Err0014.err for results
CHECK: XDrawArc-66 10, line 4750
TRACE: Trying CapRound with width of 4
REPORT: A total of 2 out of 9000 pixels were bad
REPORT: Pixel check failed. See file Err0015.err for results
CHECK: XDrawArc-66 11, line 4750
TRACE: Trying CapRound with width of 5
CHECK: XDrawArc-66 12, line 4750
TRACE: Trying CapRound with width of 10
REPORT: A total of 6 out of 9000 pixels were bad
REPORT: Pixel check failed. See file Err0016.err for results
CHECK: XDrawArc-66 13, line 4750
TRACE: Trying CapRound with width of 11
CHECK: XDrawArc-66 14, line 4750
TRACE: Trying CapRound with width of 40
REPORT: A total of 1 out of 9000 pixels were bad
REPORT: Pixel check failed. See file Err0017.err for results
CHECK: XDrawArc-66 15, line 4750
TRACE: Trying CapRound with width of 41
CHECK: XDrawArc-66 16, line 4750
TRACE: --- Running test with pixmap depth 1
TRACE: Trying CapRound with width of 1
CHECK: XDrawArc-66 17, line 4750
TRACE: Trying CapRound with width of 2
REPORT: A total of 2 out of 9000 pixels were bad
REPORT: Pixel check failed. See file Err0018.err for results
CHECK: XDrawArc-66 18, line 4750
TRACE: Trying CapRound with width of 4
REPORT: A total of 2 out of 9000 pixels were bad
REPORT: Pixel check failed. See file Err0019.err for results
CHECK: XDrawArc-66 19, line 4750
TRACE: Trying CapRound with width of 5
CHECK: XDrawArc-66 20, line 4750
TRACE: Trying CapRound with width of 10
REPORT: A total of 6 out of 9000 pixels were bad
REPORT: Pixel check failed. See file Err0020.err for results
CHECK: XDrawArc-66 21, line 4750
TRACE: Trying CapRound with width of 11
CHECK: XDrawArc-66 22, line 4750
TRACE: Trying CapRound with width of 40
REPORT: A total of 1 out of 9000 pixels were bad
REPORT: Pixel check failed. See file Err0021.err for results
CHECK: XDrawArc-66 23, line 4750
TRACE: Trying CapRound with width of 41
CHECK: XDrawArc-66 24, line 4750
TRACE: --- Running test with pixmap depth 16
TRACE: Trying CapRound with width of 1
CHECK: XDrawArc-66 25, line 4750
TRACE: Trying CapRound with width of 2
REPORT: A total of 2 out of 9000 pixels were bad
REPORT: Pixel check failed. See file Err0022.err for results
CHECK: XDrawArc-66 26, line 4750
TRACE: Trying CapRound with width of 4
REPORT: A total of 2 out of 9000 pixels were bad
REPORT: Pixel check failed. See file Err0023.err for results
CHECK: XDrawArc-66 27, line 4750
TRACE: Trying CapRound with width of 5
CHECK: XDrawArc-66 28, line 4750
TRACE: Trying CapRound with width of 10
REPORT: A total of 6 out of 9000 pixels were bad
REPORT: Pixel check failed. See file Err0024.err for results
CHECK: XDrawArc-66 29, line 4750
TRACE: Trying CapRound with width of 11
CHECK: XDrawArc-66 30, line 4750
TRACE: Trying CapRound with width of 40
REPORT: A total of 1 out of 9000 pixels were bad
REPORT: Pixel check failed. See file Err0025.err for results
CHECK: XDrawArc-66 31, line 4750
TRACE: Trying CapRound with width of 41
CHECK: XDrawArc-66 32, line 4750
TRACE: --- Running test with pixmap depth 16
TRACE: Trying CapRound with width of 1
CHECK: XDrawArc-66 33, line 4750
TRACE: Trying CapRound with width of 2
REPORT: A total of 2 out of 9000 pixels were bad
REPORT: Pixel check failed. See file Err0026.err for results
CHECK: XDrawArc-66 34, line 4750
TRACE: Trying CapRound with width of 4
REPORT: A total of 2 out of 9000 pixels were bad
REPORT: Pixel check failed. See file Err0027.err for results
CHECK: XDrawArc-66 35, line 4750
TRACE: Trying CapRound with width of 5
CHECK: XDrawArc-66 36, line 4750
TRACE: Trying CapRound with width of 10
REPORT: A total of 6 out of 9000 pixels were bad
REPORT: Pixel check failed. See file Err0028.err for results
CHECK: XDrawArc-66 37, line 4750
TRACE: Trying CapRound with width of 11
CHECK: XDrawArc-66 38, line 4750
TRACE: Trying CapRound with width of 40
REPORT: A total of 1 out of 9000 pixels were bad
REPORT: Pixel check failed. See file Err0029.err for results
CHECK: XDrawArc-66 39, line 4750
TRACE: Trying CapRound with width of 41
CHECK: XDrawArc-66 40, line 4750
/tset/Xlib9/drwarc/Test 73 	Warning 	
Messages from the test

VSW5TESTSUITE PURPOSE 73
Assertion XDrawArc-73.(A)
When a line has coincident endpoints (x1=x2, y1=y2), and
the cap_style is applied to both endpoints and the
line_width is not equal to zero and the cap_style is
CapRound, then the closed path is a circle, centered at the
endpoint, and with the diameter equal to the line-width.
METH: Draw zero length line with CapRound.
METH: Pixmap verify.
TRACE: --- Running test with visual class TrueColor, depth 16
REPORT: A total of 3 out of 9000 pixels were bad
REPORT: Pixel check failed. See file Err0030.err for results
CHECK: XDrawArc-73 1, line 5081
CHECK: XDrawArc-73 2, line 5081
TRACE: --- Running test with visual class DirectColor, depth 16
REPORT: A total of 3 out of 9000 pixels were bad
REPORT: Pixel check failed. See file Err0031.err for results
CHECK: XDrawArc-73 3, line 5081
CHECK: XDrawArc-73 4, line 5081
TRACE: --- Running test with pixmap depth 1
REPORT: A total of 3 out of 9000 pixels were bad
REPORT: Pixel check failed. See file Err0032.err for results
CHECK: XDrawArc-73 5, line 5081
CHECK: XDrawArc-73 6, line 5081
TRACE: --- Running test with pixmap depth 16
REPORT: A total of 3 out of 9000 pixels were bad
REPORT: Pixel check failed. See file Err0033.err for results
CHECK: XDrawArc-73 7, line 5081
CHECK: XDrawArc-73 8, line 5081
TRACE: --- Running test with pixmap depth 16
REPORT: A total of 3 out of 9000 pixels were bad
REPORT: Pixel check failed. See file Err0034.err for results
CHECK: XDrawArc-73 9, line 5081
CHECK: XDrawArc-73 10, line 5081
/tset/Xlib9/drwarcs/Test 45 	Warning 	
Messages from the test

VSW5TESTSUITE PURPOSE 45
Assertion XDrawArcs-45.(A)
When the line_style is LineOnOffDash, then cap_style
applies to all internal ends of the individual dashes,
except CapNotLast is treated as CapButt.
METH: Set graphics coordinates for dashed lines
METH: (includes horizontal and vertical cases,
METH: and includes joins and caps where relevant).
METH: Set the line_style of the GC to LineOnOffDash using XChangeGC.
METH: Set the dash_list of the GC to using XSetDashes.
METH: For cap_style CapNotLast, CapButt, CapProjecting, CapRound:
METH: Set the cap_style of the GC using XChangeGC.
METH: Draw paths.
METH: Pixmap verify.
METH: Clear drawable.
TRACE: --- Running test with visual class TrueColor, depth 16
TRACE: LineOnOffDash with CapNotLast width 4
CHECK: XDrawArcs-45 1, line 3912
TRACE: LineOnOffDash with CapButt width 4
CHECK: XDrawArcs-45 2, line 3912
TRACE: LineOnOffDash with CapProjecting width 4
CHECK: XDrawArcs-45 3, line 3912
TRACE: LineOnOffDash with CapRound width 4
REPORT: A total of 8 out of 9000 pixels were bad
REPORT: Pixel check failed. See file Err0000.err for results
CHECK: XDrawArcs-45 4, line 3912
TRACE: LineOnOffDash with CapNotLast width 5
CHECK: XDrawArcs-45 5, line 3912
TRACE: LineOnOffDash with CapButt width 5
CHECK: XDrawArcs-45 6, line 3912
TRACE: LineOnOffDash with CapProjecting width 5
CHECK: XDrawArcs-45 7, line 3912
TRACE: LineOnOffDash with CapRound width 5
CHECK: XDrawArcs-45 8, line 3912
TRACE: --- Running test with visual class DirectColor, depth 16
TRACE: LineOnOffDash with CapNotLast width 4
CHECK: XDrawArcs-45 9, line 3912
TRACE: LineOnOffDash with CapButt width 4
CHECK: XDrawArcs-45 10, line 3912
TRACE: LineOnOffDash with CapProjecting width 4
CHECK: XDrawArcs-45 11, line 3912
TRACE: LineOnOffDash with CapRound width 4
REPORT: A total of 8 out of 9000 pixels were bad
REPORT: Pixel check failed. See file Err0001.err for results
CHECK: XDrawArcs-45 12, line 3912
TRACE: LineOnOffDash with CapNotLast width 5
CHECK: XDrawArcs-45 13, line 3912
TRACE: LineOnOffDash with CapButt width 5
CHECK: XDrawArcs-45 14, line 3912
TRACE: LineOnOffDash with CapProjecting width 5
CHECK: XDrawArcs-45 15, line 3912
TRACE: LineOnOffDash with CapRound width 5
CHECK: XDrawArcs-45 16, line 3912
TRACE: --- Running test with pixmap depth 1
TRACE: LineOnOffDash with CapNotLast width 4
CHECK: XDrawArcs-45 17, line 3912
TRACE: LineOnOffDash with CapButt width 4
CHECK: XDrawArcs-45 18, line 3912
TRACE: LineOnOffDash with CapProjecting width 4
CHECK: XDrawArcs-45 19, line 3912
TRACE: LineOnOffDash with CapRound width 4
REPORT: A total of 8 out of 9000 pixels were bad
REPORT: Pixel check failed. See file Err0002.err for results
CHECK: XDrawArcs-45 20, line 3912
TRACE: LineOnOffDash with CapNotLast width 5
CHECK: XDrawArcs-45 21, line 3912
TRACE: LineOnOffDash with CapButt width 5
CHECK: XDrawArcs-45 22, line 3912
TRACE: LineOnOffDash with CapProjecting width 5
CHECK: XDrawArcs-45 23, line 3912
TRACE: LineOnOffDash with CapRound width 5
CHECK: XDrawArcs-45 24, line 3912
TRACE: --- Running test with pixmap depth 16
TRACE: LineOnOffDash with CapNotLast width 4
CHECK: XDrawArcs-45 25, line 3912
TRACE: LineOnOffDash with CapButt width 4
CHECK: XDrawArcs-45 26, line 3912
TRACE: LineOnOffDash with CapProjecting width 4
CHECK: XDrawArcs-45 27, line 3912
TRACE: LineOnOffDash with CapRound width 4
REPORT: A total of 8 out of 9000 pixels were bad
REPORT: Pixel check failed. See file Err0003.err for results
CHECK: XDrawArcs-45 28, line 3912
TRACE: LineOnOffDash with CapNotLast width 5
CHECK: XDrawArcs-45 29, line 3912
TRACE: LineOnOffDash with CapButt width 5
CHECK: XDrawArcs-45 30, line 3912
TRACE: LineOnOffDash with CapProjecting width 5
CHECK: XDrawArcs-45 31, line 3912
TRACE: LineOnOffDash with CapRound width 5
CHECK: XDrawArcs-45 32, line 3912
TRACE: --- Running test with pixmap depth 16
TRACE: LineOnOffDash with CapNotLast width 4
CHECK: XDrawArcs-45 33, line 3912
TRACE: LineOnOffDash with CapButt width 4
CHECK: XDrawArcs-45 34, line 3912
TRACE: LineOnOffDash with CapProjecting width 4
CHECK: XDrawArcs-45 35, line 3912
TRACE: LineOnOffDash with CapRound width 4
REPORT: A total of 8 out of 9000 pixels were bad
REPORT: Pixel check failed. See file Err0004.err for results
CHECK: XDrawArcs-45 36, line 3912
TRACE: LineOnOffDash with CapNotLast width 5
CHECK: XDrawArcs-45 37, line 3912
TRACE: LineOnOffDash with CapButt width 5
CHECK: XDrawArcs-45 38, line 3912
TRACE: LineOnOffDash with CapProjecting width 5
CHECK: XDrawArcs-45 39, line 3912
TRACE: LineOnOffDash with CapRound width 5
CHECK: XDrawArcs-45 40, line 3912
/tset/Xlib9/drwarcs/Test 66 	Warning 	
Messages from the test

VSW5TESTSUITE PURPOSE 66
Assertion XDrawArcs-66.(A)
When the cap_style is CapNotLast and the line_width is zero
(0), then this is equivalent to CapButt except that the
final endpoint is not drawn.
METH: Draw line with CapButt.
METH: Set GC component function to GXxor.
METH: Draw line with CapNotLast.
METH: Verify that only the final end point is set.
TRACE: --- Running test with visual class TrueColor, depth 16
REPORT: Pixel mismatch in image
REPORT: See file Err0005.err for details
REPORT: Cap style incorrect for thin line and CapNotLast
CHECK: XDrawArcs-66 1, line 4908
TRACE: --- Running test with visual class DirectColor, depth 16
REPORT: Pixel mismatch in image
REPORT: See file Err0006.err for details
REPORT: Cap style incorrect for thin line and CapNotLast
CHECK: XDrawArcs-66 2, line 4908
TRACE: --- Running test with pixmap depth 1
REPORT: Pixel mismatch in image
REPORT: See file Err0007.err for details
REPORT: Cap style incorrect for thin line and CapNotLast
CHECK: XDrawArcs-66 3, line 4908
TRACE: --- Running test with pixmap depth 16
REPORT: Pixel mismatch in image
REPORT: See file Err0008.err for details
REPORT: Cap style incorrect for thin line and CapNotLast
CHECK: XDrawArcs-66 4, line 4908
TRACE: --- Running test with pixmap depth 16
REPORT: Pixel mismatch in image
REPORT: See file Err0009.err for details
REPORT: Cap style incorrect for thin line and CapNotLast
CHECK: XDrawArcs-66 5, line 4908
/tset/Xlib9/drwarcs/Test 69 	Warning 	
Messages from the test

VSW5TESTSUITE PURPOSE 69
Assertion XDrawArcs-69.(A)
When the cap_style is CapRound and line-width is not zero,
then the line has a circular arc, with the diamater equal to
the line_width, centred on the endpoint.
METH: For a variety of line widths.
METH: Draw line with CapRound.
METH: Pixmap verify.
TRACE: --- Running test with visual class TrueColor, depth 16
TRACE: Trying CapRound with width of 1
CHECK: XDrawArcs-69 1, line 5036
TRACE: Trying CapRound with width of 2
REPORT: A total of 2 out of 9000 pixels were bad
REPORT: Pixel check failed. See file Err0010.err for results
CHECK: XDrawArcs-69 2, line 5036
TRACE: Trying CapRound with width of 4
REPORT: A total of 2 out of 9000 pixels were bad
REPORT: Pixel check failed. See file Err0011.err for results
CHECK: XDrawArcs-69 3, line 5036
TRACE: Trying CapRound with width of 5
CHECK: XDrawArcs-69 4, line 5036
TRACE: Trying CapRound with width of 10
REPORT: A total of 6 out of 9000 pixels were bad
REPORT: Pixel check failed. See file Err0012.err for results
CHECK: XDrawArcs-69 5, line 5036
TRACE: Trying CapRound with width of 11
CHECK: XDrawArcs-69 6, line 5036
TRACE: Trying CapRound with width of 40
REPORT: A total of 1 out of 9000 pixels were bad
REPORT: Pixel check failed. See file Err0013.err for results
CHECK: XDrawArcs-69 7, line 5036
TRACE: Trying CapRound with width of 41
CHECK: XDrawArcs-69 8, line 5036
TRACE: --- Running test with visual class DirectColor, depth 16
TRACE: Trying CapRound with width of 1
CHECK: XDrawArcs-69 9, line 5036
TRACE: Trying CapRound with width of 2
REPORT: A total of 2 out of 9000 pixels were bad
REPORT: Pixel check failed. See file Err0014.err for results
CHECK: XDrawArcs-69 10, line 5036
TRACE: Trying CapRound with width of 4
REPORT: A total of 2 out of 9000 pixels were bad
REPORT: Pixel check failed. See file Err0015.err for results
CHECK: XDrawArcs-69 11, line 5036
TRACE: Trying CapRound with width of 5
CHECK: XDrawArcs-69 12, line 5036
TRACE: Trying CapRound with width of 10
REPORT: A total of 6 out of 9000 pixels were bad
REPORT: Pixel check failed. See file Err0016.err for results
CHECK: XDrawArcs-69 13, line 5036
TRACE: Trying CapRound with width of 11
CHECK: XDrawArcs-69 14, line 5036
TRACE: Trying CapRound with width of 40
REPORT: A total of 1 out of 9000 pixels were bad
REPORT: Pixel check failed. See file Err0017.err for results
CHECK: XDrawArcs-69 15, line 5036
TRACE: Trying CapRound with width of 41
CHECK: XDrawArcs-69 16, line 5036
TRACE: --- Running test with pixmap depth 1
TRACE: Trying CapRound with width of 1
CHECK: XDrawArcs-69 17, line 5036
TRACE: Trying CapRound with width of 2
REPORT: A total of 2 out of 9000 pixels were bad
REPORT: Pixel check failed. See file Err0018.err for results
CHECK: XDrawArcs-69 18, line 5036
TRACE: Trying CapRound with width of 4
REPORT: A total of 2 out of 9000 pixels were bad
REPORT: Pixel check failed. See file Err0019.err for results
CHECK: XDrawArcs-69 19, line 5036
TRACE: Trying CapRound with width of 5
CHECK: XDrawArcs-69 20, line 5036
TRACE: Trying CapRound with width of 10
REPORT: A total of 6 out of 9000 pixels were bad
REPORT: Pixel check failed. See file Err0020.err for results
CHECK: XDrawArcs-69 21, line 5036
TRACE: Trying CapRound with width of 11
CHECK: XDrawArcs-69 22, line 5036
TRACE: Trying CapRound with width of 40
REPORT: A total of 1 out of 9000 pixels were bad
REPORT: Pixel check failed. See file Err0021.err for results
CHECK: XDrawArcs-69 23, line 5036
TRACE: Trying CapRound with width of 41
CHECK: XDrawArcs-69 24, line 5036
TRACE: --- Running test with pixmap depth 16
TRACE: Trying CapRound with width of 1
CHECK: XDrawArcs-69 25, line 5036
TRACE: Trying CapRound with width of 2
REPORT: A total of 2 out of 9000 pixels were bad
REPORT: Pixel check failed. See file Err0022.err for results
CHECK: XDrawArcs-69 26, line 5036
TRACE: Trying CapRound with width of 4
REPORT: A total of 2 out of 9000 pixels were bad
REPORT: Pixel check failed. See file Err0023.err for results
CHECK: XDrawArcs-69 27, line 5036
TRACE: Trying CapRound with width of 5
CHECK: XDrawArcs-69 28, line 5036
TRACE: Trying CapRound with width of 10
REPORT: A total of 6 out of 9000 pixels were bad
REPORT: Pixel check failed. See file Err0024.err for results
CHECK: XDrawArcs-69 29, line 5036
TRACE: Trying CapRound with width of 11
CHECK: XDrawArcs-69 30, line 5036
TRACE: Trying CapRound with width of 40
REPORT: A total of 1 out of 9000 pixels were bad
REPORT: Pixel check failed. See file Err0025.err for results
CHECK: XDrawArcs-69 31, line 5036
TRACE: Trying CapRound with width of 41
CHECK: XDrawArcs-69 32, line 5036
TRACE: --- Running test with pixmap depth 16
TRACE: Trying CapRound with width of 1
CHECK: XDrawArcs-69 33, line 5036
TRACE: Trying CapRound with width of 2
REPORT: A total of 2 out of 9000 pixels were bad
REPORT: Pixel check failed. See file Err0026.err for results
CHECK: XDrawArcs-69 34, line 5036
TRACE: Trying CapRound with width of 4
REPORT: A total of 2 out of 9000 pixels were bad
REPORT: Pixel check failed. See file Err0027.err for results
CHECK: XDrawArcs-69 35, line 5036
TRACE: Trying CapRound with width of 5
CHECK: XDrawArcs-69 36, line 5036
TRACE: Trying CapRound with width of 10
REPORT: A total of 6 out of 9000 pixels were bad
REPORT: Pixel check failed. See file Err0028.err for results
CHECK: XDrawArcs-69 37, line 5036
TRACE: Trying CapRound with width of 11
CHECK: XDrawArcs-69 38, line 5036
TRACE: Trying CapRound with width of 40
REPORT: A total of 1 out of 9000 pixels were bad
REPORT: Pixel check failed. See file Err0029.err for results
CHECK: XDrawArcs-69 39, line 5036
TRACE: Trying CapRound with width of 41
CHECK: XDrawArcs-69 40, line 5036
/tset/Xlib9/drwarcs/Test 76 	Warning 	
Messages from the test

VSW5TESTSUITE PURPOSE 76
Assertion XDrawArcs-76.(A)
When a line has coincident endpoints (x1=x2, y1=y2), and
the cap_style is applied to both endpoints and the
line_width is not equal to zero and the cap_style is
CapRound, then the closed path is a circle, centered at the
endpoint, and with the diameter equal to the line-width.
METH: Draw zero length line with CapRound.
METH: Pixmap verify.
TRACE: --- Running test with visual class TrueColor, depth 16
REPORT: A total of 3 out of 9000 pixels were bad
REPORT: Pixel check failed. See file Err0030.err for results
CHECK: XDrawArcs-76 1, line 5367
CHECK: XDrawArcs-76 2, line 5367
TRACE: --- Running test with visual class DirectColor, depth 16
REPORT: A total of 3 out of 9000 pixels were bad
REPORT: Pixel check failed. See file Err0031.err for results
CHECK: XDrawArcs-76 3, line 5367
CHECK: XDrawArcs-76 4, line 5367
TRACE: --- Running test with pixmap depth 1
REPORT: A total of 3 out of 9000 pixels were bad
REPORT: Pixel check failed. See file Err0032.err for results
CHECK: XDrawArcs-76 5, line 5367
CHECK: XDrawArcs-76 6, line 5367
TRACE: --- Running test with pixmap depth 16
REPORT: A total of 3 out of 9000 pixels were bad
REPORT: Pixel check failed. See file Err0033.err for results
CHECK: XDrawArcs-76 7, line 5367
CHECK: XDrawArcs-76 8, line 5367
TRACE: --- Running test with pixmap depth 16
REPORT: A total of 3 out of 9000 pixels were bad
REPORT: Pixel check failed. See file Err0034.err for results
CHECK: XDrawArcs-76 9, line 5367
CHECK: XDrawArcs-76 10, line 5367
/tset/Xlib17/gtdflt/Test 5 	Failed 	Appears in multiple distros
Messages from the test

VSW5TESTSUITE PURPOSE 5
Assertion XGetDefault-5.(C)
If the system is POSIX compliant: When the XENVIRONMENT
environment variable is not defined, then the file
$HOME/.Xdefaults-<name> is merged to update the default
resource database, where <name> specifies the name of the
machine on which the application is running.
METH: Fork a new process using tet_fork.
METH: In the child process:
METH: Remove XENVIRONMENT from the environment
METH: Execute the file ./Test5 using tet_exec with the HOME variable set to ".".
METH: In Test5:
METH: Set the RESOURCE_MANAGER property using XChangeProperty.
METH: Open a display using XOpenDisplay.
METH: Obtain the value of resources set by the ChangeProperty request and by the file $HOME/.Xdefaults-<name> using XGetDefault.
METH: Verify that the resources are set from each source.
METH: Verify that the .Xdefaults-<name> resources updated those of the ChangeProperty request.
TRACE: Exec'd file ./Test5 with HOME = ".".
CHECK: XGetDefault-5 1, line 158
CHECK: XGetDefault-5 2, line 164
CHECK: XGetDefault-5 3, line 184
CHECK: XGetDefault-5 4, line 189
CHECK: XGetDefault-5 5, line 184
REPORT: XGetDefault() with program = "XTest" and option = "testval52" returned "pVAL_2" instead of "hVAL_5".
REPORT: XGetDefault() returned NULL with program = "XTest" and option = "testval56".
REPORT: XGetDefault() returned NULL with program = "XTest" and option = "testval57".
Comment:
Same failure was reported 2006-02-09 in Fedora Core 5 T2 under VMWare, see http://lists.freestandards.org/pipermail/lsb-desktop/2006-February/000345.html
/tset/Xlib17/kycdtkysym/Test 	Test Suite Error 	Test case controller reports a problem
Messages from the test

(exec.c, 131): can't exec /root/tmp/xts5/tset/Xlib17/kycdtkysym/Test, reply code = ER_NOENT
/tset/Xlib17/kycdtkysym/Test 	Warning 	Test case contains no test points
Messages from the test
(none)
/tset/Xlib17/lkpkysym/Test 	Test Suite Error 	Test case controller reports a problem
Messages from the test

(exec.c, 131): can't exec /root/tmp/xts5/tset/Xlib17/lkpkysym/Test, reply code = ER_NOENT
/tset/Xlib17/lkpkysym/Test 	Warning 	Test case contains no test points
Messages from the test
(none)

Application Battery

Apache Tests v 2.2.4-2

Check init.d runlevel 2 for apache via chkconfig 	failed 	
test command failed with result 1: grep -e '2:on' /tmp/lsb-autotest-stdout.txt
Standard output was: lsb-apache 0:off 1:off 2:off 3:on 4:on 5:on 6:off
Error output was:

[Article] [Discussion] [View source] [History]